program: Gaussian 09
title: 000110615
version: EM64L-G09RevD.01
frameworkgroup: C1[X(C12H18O2)]
method: RPBEPBE
basis: SDD
operation: Freq
keyword: #pfreq=noraman
keyword: PBEPBE/SDD
title: #p freq=noraman PBEPBE/SDD
converged: YES YES NO NO
title: Mulliken charges:
elementType: O O C C C C C C C C C C C C H H H H H H H H H H H H H H H H H H
charge: -0.246895 -0.425199 -0.168860 -0.142895 -0.268924 -0.261194 -0.540280 -0.058489 -0.491760 -0.480113 -0.233610 -0.227010 -0.249705 -0.325778 0.259474 0.247352 0.240486 0.246333 0.250777 0.214964 0.194382 0.226677 0.213085 0.226718 0.221761 0.238175 0.237854 0.194199 0.171560 0.177099 0.230310 0.329506
chargesum: 0.00000
title: Mulliken charges with hydrogens summed into heavy atoms:
elementType: O O C C C C C C C C C C C C
charge: -0.246895 -0.095693 0.090614 0.104457 -0.028439 -0.014860 -0.074539 0.135893 -0.051998 -0.031633 0.004564 0.010844 0.116054 0.081632
polarizability: 1.45076465e+02 1.64071092e+00 1.26391500e+02 -2.26181685e+00 2.34972072e+00 1.03236274e+02
1716.lowfreq: -11.6983 0.0008 0.0010 0.0010 5.8223 10.2563 39.9773 57.6027 81.9065
frequency: 39.9097 57.5719 81.8699 107.1482 142.1231 178.3624 188.5497 250.6485 273.1412 293.1232 371.9707 401.5689 411.8488 453.9098 469.2607 513.6791 572.9044 612.3485 681.2685 711.3998 762.1945 767.7741 828.0445 840.1205 856.9807 863.1863 892.5142 900.0331 910.4923 918.4793 927.1372 941.9153 970.2653 974.7742 991.9652 1002.4397 1015.9577 1024.6581 1033.4916 1059.2939 1078.4996 1087.8286 1091.7865 1103.6073 1115.4977 1136.5955 1145.0304 1169.1517 1173.5241 1192.2160 1226.8251 1231.0732 1252.0937 1256.4046 1259.2008 1264.7665 1274.4702 1284.0443 1288.8619 1306.4481 1310.2229 1312.8195 1314.3617 1336.4632 1386.6812 1391.5028 1458.1552 1467.6781 1471.3226 1472.8386 1485.2810 1580.9431 2883.4613 2901.2405 2939.6090 2955.4111 2988.6066 3005.0752 3009.0154 3020.0667 3033.6611 3059.8251 3062.0345 3074.1711 3076.4265 3083.7687 3086.9992 3151.2054 3184.5784 3559.1253
redmass: 4.1636 3.8590 2.6243 2.0560 2.9484 2.6329 2.1709 2.7814 2.1388 3.0427 3.0799 3.4881 3.4445 3.1878 2.2936 2.0399 2.4015 3.1058 2.6128 1.7111 3.9738 3.5994 2.6835 2.9795 2.1309 2.5321 2.2795 2.2829 2.1723 1.5167 1.9611 2.8417 1.8768 2.1726 1.9823 2.1711 1.5495 1.8061 1.5780 2.5756 2.8837 2.1158 1.9720 1.1802 2.1629 1.5507 1.3425 1.3188 1.6137 1.4737 1.5445 1.3285 1.2556 1.2429 1.3647 1.4047 1.4547 1.3088 1.3302 1.4093 1.3891 1.3377 1.7043 1.3379 1.2603 1.3920 1.0807 1.0895 1.0825 1.1007 1.0929 5.8049 1.0617 1.0834 1.0809 1.0862 1.0637 1.0625 1.0613 1.0853 1.0880 1.0976 1.0889 1.0932 1.1028 1.0928 1.1032 1.0870 1.1095 1.0662
irintensity: 2.2518 1.5764 9.7016 27.0573 2.5678 40.5561 72.5397 1.2497 35.1781 3.9020 2.3660 0.6134 5.9536 1.8235 6.4526 5.6541 9.1013 0.8776 6.1614 60.9980 1.4402 3.9390 14.7245 11.6531 7.1905 22.5270 3.3064 4.6103 1.2502 4.4768 3.3457 9.1415 2.9429 1.0876 10.6656 14.2956 10.6413 96.4784 7.2711 52.7879 9.3092 38.7387 29.1457 0.8388 0.9218 0.0376 2.3955 16.1684 5.5646 3.0569 2.0989 2.7265 7.5637 1.1035 1.2781 1.5648 2.6606 0.5471 0.7761 8.5559 8.9835 7.3220 8.7480 36.3343 11.8559 12.3021 6.3613 0.6133 7.8598 16.3607 15.3907 3.8716 41.7503 58.5636 34.7134 114.4962 29.6790 24.4582 44.6381 8.4668 27.9499 65.7014 57.5687 16.6475 52.0323 23.0564 33.7798 7.3109 23.7977 5.5934
temp: 298.150 k
press: 1.00000 atm
elementType: 8 8 6 6 6 6 6 6 6 6 6 6 6 6 1 1 1 1 1 1 1 1 1 1 1 1 1 1 1 1 1 1
symmnumber: 1
zpe: 725504.0 jmol-1
zpe.correction: 0.276330 hartree
zpe.thermalcorrener: 0.289230 hartree
zpe.thermalcorrenthalpy: 0.290174 hartree
zpe.thermalcorrgfe: 0.236443 hartree
zpe.sumelectzpe: -617.365610 hartree
zpe.sumelectthermal: -617.352710 hartree
zpe.sumelectthermalent: -617.351766 hartree
zpe.sumelectthermalfe: -617.405497 hartree
dipole: 2.4068 -1.5769 1.3232
dipole: 3.1670
quadrupole: -99.9905 -82.5926 -80.5936
quadrupole: 9.8416 -6.6105 1.5773
quadrupole: -12.2649 5.1330 7.1320 9.8416 -6.6105 1.5773
hfenergy: -617.6419404 hartree
pointgroup: C01 [X(C12H18O2)]
dipole: 0.9604767 -0.603088 0.516017 debye
polarizability: 144.9873942|1.9847646|126.4583401|-2.5151211|2.2883226|103.2585049 unknown
InChI: InChI=1S/C12H18O2/c13-5-6-14-11-4-3-10-8-1-2-9(7-8)12(10)11/h1-2,8-13H,3-7H2
charge 0 multiplicity 1
32 atoms
O  -2.015104 0.449456 -0.294549
O  -4.899127 -0.118754 0.375924
C  0.464436 -0.101664 -0.408167
C  1.684944 0.888994 -0.589223
C  1.077563 -1.254371 0.479905
C  2.839233 0.172076 0.216751
C  2.032776 -0.437327 1.408949
C  -0.677352 0.740764 0.23957
C  1.210684 2.259874 -0.014751
C  -0.335817 2.207965 -0.089495
C  2.11365 -1.96407 -0.406852
C  3.168337 -1.111448 -0.563164
C  -2.511932 -0.873396 0.073025
C  -3.976899 -0.995897 -0.351562
H  0.101559 -0.49151 -1.37674
H  1.964711 0.99615 -1.651741
H  0.334088 -1.901944 0.972185
H  3.689469 0.825699 0.466858
H  2.652307 -1.083657 2.052944
H  1.516545 0.316349 2.031424
H  -0.690945 0.575485 1.34309
H  1.626631 3.11446 -0.577065
H  1.539649 2.372467 1.036762
H  -0.839061 2.923813 0.583269
H  -0.684707 2.411207 -1.119743
H  1.962738 -2.931641 -0.893721
H  4.045149 -1.247872 -1.202231
H  -1.922529 -1.670021 -0.435104
H  -2.407914 -1.031929 1.174939
H  -4.281529 -2.061018 -0.244718
H  -4.081928 -0.701003 -1.408726
H  -4.686025 -0.152937 1.342857
