program: Gaussian 09
title: 000110609
version: EM64L-G09RevD.01
frameworkgroup: C1[X(C9H17NO)]
method: RPBEPBE
basis: SDD
operation: Freq
keyword: #p
keyword: freq=noraman
keyword: PBEPBE/SDD
title: #p freq=noraman PBEPBE/SDD
converged: YES YES NO NO
title: Mulliken charges:
elementType: O N C C C C C C C C C H H H H H H H H H H H H H H H H H
charge: -0.269112 -0.021923 -0.021213 -0.366660 -0.407276 -0.269423 -0.714288 -0.712033 -0.215036 -0.436516 -0.120257 0.196775 0.185145 0.185648 0.221509 0.214110 0.186125 0.192452 0.201865 0.226122 0.212713 0.212521 0.204794 0.214525 0.197426 0.201232 0.264382 0.236393
chargesum: 0.00000
title: Mulliken charges with hydrogens summed into heavy atoms:
elementType: O N C C C C C C C C C
charge: -0.269112 -0.021923 0.175563 0.004133 0.028342 0.109154 -0.073588 -0.080193 0.183623 0.064259 -0.120257
polarizability: 1.24914758e+02 -1.25844197e+00 1.00211608e+02 -3.18162045e-01 -3.86155923e+00 8.95481342e+01
1716.lowfreq: -13.0954 0.0004 0.0005 0.0007 1.0466 4.4809 19.0320 27.7359 60.9643
frequency: 14.7111 27.6912 60.9535 80.4830 82.5187 117.8295 140.8001 185.4004 201.3742 216.1339 228.5624 246.5724 326.6143 365.9832 375.8289 403.4475 446.8813 483.6476 577.9634 752.4444 801.1226 827.6081 830.0718 853.6842 914.1159 937.6344 954.4025 974.8565 1004.8908 1020.7413 1042.8311 1061.4210 1076.5338 1084.6659 1143.9445 1149.6177 1177.7786 1190.8921 1199.4114 1239.8645 1256.0933 1266.1453 1282.7230 1311.1472 1326.7317 1332.6901 1341.4456 1354.4327 1376.6728 1393.5410 1402.9059 1433.3264 1457.7555 1468.4894 1470.2393 1472.6978 1479.8077 1482.4327 1488.9670 1492.2603 2205.2493 2910.8129 2930.3752 2947.4248 2958.6002 2961.7113 2965.1216 2970.3606 2980.9865 2996.3216 3001.7293 3009.9153 3056.8029 3061.6619 3065.8655 3068.1268 3068.5171 3075.3601
redmass: 2.9795 5.8492 3.5568 2.2911 2.4709 2.8559 2.8928 2.6236 1.1276 2.7972 1.2943 2.6515 2.8937 3.5593 2.4770 2.2552 2.8720 2.9060 3.4048 1.1307 2.6423 2.4738 2.7776 1.2869 1.1761 1.9258 1.4225 2.9698 1.4415 2.7709 2.4425 2.7323 3.1813 2.9267 2.4305 1.4600 1.7830 1.2472 1.3608 1.1733 1.2623 1.2397 1.0873 1.3138 1.4236 1.4061 1.3234 1.5084 1.2175 1.2172 1.4281 1.0904 1.0687 1.0464 1.0836 1.0613 1.0709 1.0708 1.0495 1.0833 12.4375 1.0549 1.0558 1.0609 1.0815 1.1049 1.0357 1.0369 1.1035 1.0613 1.0992 1.0620 1.0993 1.1024 1.1002 1.1005 1.0992 1.0989
irintensity: 1.6991 3.6781 1.7356 2.7067 1.1775 1.0973 6.5380 1.9360 0.2706 0.3824 0.0651 0.9659 2.4750 0.3476 0.6092 1.7298 0.6747 6.0131 6.4415 5.6109 1.1524 3.2292 0.6762 3.0151 3.8135 9.9202 1.8193 14.9590 1.6295 24.1473 14.8123 25.7262 82.0800 42.1601 0.6828 0.6303 12.1135 3.8896 6.1911 5.0940 2.3575 1.5132 0.1135 0.2756 8.1708 2.8545 35.9561 10.6462 22.1842 14.8456 0.6449 19.6618 0.8132 2.7749 7.4291 5.1297 1.2473 7.3362 21.8691 10.4331 9.1174 37.3914 90.8390 29.5135 30.3108 44.9050 42.9335 27.9403 39.1798 28.0980 27.3393 18.8898 8.4583 10.2412 125.6889 8.1374 61.8915 51.5663
temp: 298.150 k
press: 1.00000 atm
elementType: 8 7 6 6 6 6 6 6 6 6 6 1 1 1 1 1 1 1 1 1 1 1 1 1 1 1 1 1
symmnumber: 1
zpe: 639687.4 jmol-1
zpe.correction: 0.243644 hartree
zpe.thermalcorrener: 0.257730 hartree
zpe.thermalcorrenthalpy: 0.258674 hartree
zpe.thermalcorrgfe: 0.200257 hartree
zpe.sumelectzpe: -482.199829 hartree
zpe.sumelectthermal: -482.185743 hartree
zpe.sumelectthermalent: -482.184799 hartree
zpe.sumelectthermalfe: -482.243217 hartree
dipole: 1.4841 -4.5305 0.4036
dipole: 4.7845
quadrupole: -73.1804 -73.2940 -68.8725
quadrupole: 18.2514 -5.0760 2.1709
quadrupole: -1.3981 -1.5117 2.9098 18.2514 -5.0760 2.1709
hfenergy: -482.4434735 hartree
pointgroup: C01 [X(C9H17N1O1)]
dipole: -0.6232916 1.7201104 0.4426878 debye
polarizability: 124.9563791|-0.5113764|98.7230999|-0.5451146|5.3181877|90.9950212 unknown
InChI: InChI=1S/C9H17NO/c1-9(2)5-3-7-11-8-4-6-10/h9H,3-5,7-8H2,1-2H3
charge 0 multiplicity 1
28 atoms
O  1.322503 0.469409 0.34769
N  4.236273 -1.649525 -0.917424
C  -3.577548 -0.538602 -0.123011
C  -2.429089 0.477177 -0.369444
C  -1.055379 0.027336 0.18046
C  0.066934 0.98865 -0.218864
C  -3.862201 -0.743807 1.384481
C  -4.860988 -0.08982 -0.861226
C  2.478157 1.299639 0.028514
C  3.726574 0.53898 0.517567
C  4.002963 -0.67475 -0.270648
H  -3.258779 -1.51451 -0.548599
H  -2.341881 0.649043 -1.46318
H  -2.712897 1.453057 0.079786
H  -1.078503 -0.042625 1.283546
H  -0.807144 -0.981534 -0.202103
H  -0.130834 2.013009 0.172157
H  0.157033 1.053166 -1.326752
H  -4.145868 0.215396 1.860505
H  -2.983584 -1.144058 1.921255
H  -4.697175 -1.453383 1.533808
H  -4.681981 0.02633 -1.946777
H  -5.218058 0.883337 -0.470933
H  -5.676434 -0.824757 -0.727435
H  2.540481 1.4938 -1.064262
H  2.418247 2.277869 0.555555
H  3.574009 0.254568 1.574972
H  4.610367 1.203205 0.471461
