program: Gaussian 09
title: 000110603
version: EM64L-G09RevD.01
frameworkgroup: C1[X(C9H10Cl2O)]
method: RPBEPBE
basis: SDD
operation: Freq
keyword: #p
keyword: freq=noraman
keyword: PBEPBE/SDD
title: #p freq=noraman PBEPBE/SDD
converged: YES YES NO NO
title: Mulliken charges:
elementType: Cl Cl O C C C C C C C C C H H H H H H H H H H
charge: -0.056436 -0.061112 -0.483075 0.117905 0.475031 -0.699502 -0.700421 -0.380472 -0.378624 -0.056054 -0.093840 -0.253838 0.204993 0.221285 0.251870 0.204919 0.221879 0.251741 0.259998 0.323599 0.347221 0.282935
chargesum: 0.00000
title: Mulliken charges with hydrogens summed into heavy atoms:
elementType: Cl Cl O C C C C C C C C C
charge: -0.056436 -0.061112 -0.135854 0.117905 0.475031 -0.021354 -0.021882 -0.120475 -0.055025 -0.056054 -0.093840 0.029097
polarizability: 1.46487139e+02 -2.13973165e+00 1.43770016e+02 -2.82433439e-02 -7.88904814e-03 6.50452541e+01
1716.lowfreq: -9.0132 -0.0023 -0.0021 0.0011 3.0324 5.4367 35.4283 100.3300 141.0662
frequency: 35.1939 100.3220 141.0658 166.1930 168.1665 199.0956 224.0783 253.8447 255.1577 277.4505 305.0749 319.7789 363.9310 386.3073 411.2017 421.4180 499.5377 516.4443 544.5935 588.5197 690.2448 748.6295 754.8410 862.0060 865.2633 880.6348 910.4019 925.2292 931.2003 981.4943 1000.8471 1077.3351 1093.4470 1107.0097 1150.4912 1177.8742 1181.4824 1252.3381 1331.4994 1373.5964 1378.4158 1397.9969 1405.5548 1431.5168 1455.8559 1460.7965 1473.6360 1483.1810 1564.4505 1599.1365 2979.3677 2983.0944 3071.1032 3077.9946 3099.2689 3102.7306 3159.5213 3186.9157 3199.6092 3573.5604
redmass: 3.8656 4.5031 6.0866 15.0576 4.8221 4.0315 1.1098 1.0652 1.2030 2.5869 3.1436 5.9248 3.1342 7.0966 7.5780 3.7850 4.0020 5.5016 3.0832 4.4507 2.3786 10.9914 6.4391 1.4353 3.2227 1.4938 1.5259 1.3491 2.4021 6.0209 1.2996 1.5319 1.4550 1.6117 2.7581 2.3091 3.9469 1.2057 2.0120 9.0717 1.1990 1.3601 2.3278 2.8364 1.0500 1.0520 1.0515 1.1413 7.4766 7.5521 1.0370 1.0370 1.0978 1.0971 1.1003 1.1001 1.0922 1.0941 1.0926 1.0660
irintensity: 1.4779 0.6422 1.3955 0.6059 0.6254 0.6708 0.9126 140.6280 6.2983 0.5380 5.0440 2.0900 0.7644 10.4119 7.7574 11.3793 3.5250 0.0293 13.5266 0.6442 27.3902 105.6462 15.7487 30.5900 25.2643 13.4520 0.2029 13.2367 9.1095 3.2644 0.6761 36.0188 48.4046 1.8929 80.5970 12.0544 24.9075 0.2718 59.9407 8.9054 23.5269 4.9298 81.8039 6.3777 0.1163 3.3210 10.3748 15.4897 108.0888 76.4856 12.8924 39.7727 2.4181 70.4914 12.4815 22.3157 2.2481 1.0631 6.8616 5.8279
temp: 298.150 k
press: 1.00000 atm
elementType: 17 17 8 6 6 6 6 6 6 6 6 6 1 1 1 1 1 1 1 1 1 1
symmnumber: 1
zpe: 433986.9 jmol-1
zpe.correction: 0.165297 hartree
zpe.thermalcorrener: 0.177910 hartree
zpe.thermalcorrenthalpy: 0.178855 hartree
zpe.thermalcorrgfe: 0.126025 hartree
zpe.sumelectzpe: -1343.402778 hartree
zpe.sumelectthermal: -1343.390165 hartree
zpe.sumelectthermalent: -1343.389221 hartree
zpe.sumelectthermalfe: -1343.442051 hartree
dipole: -4.0014 1.2685 0.0256
dipole: 4.1978
quadrupole: -72.1959 -91.2576 -86.8646
quadrupole: -1.4893 -0.0800 -0.0448
quadrupole: 11.2435 -7.8183 -3.4252 -1.4893 -0.0800 -0.0448
hfenergy: -1343.5680752 hartree
pointgroup: C01 [X(C9H10Cl2O1)]
dipole: -1.5691223 -0.4787785 -0.1901885 debye
dipolederiv: -0.3489509 -0.3034897 -0.0955232 -0.3202746 -0.6183738 -0.1674011 -0.1003836 -0.1668774 -0.1231923 -0.3261995 0.2791969 0.0748548 0.3107702 -0.6207141 -0.152078 0.0842181 -0.1530466 -0.1138119 -0.3635079 0.2021817 0.0708323 0.2119164 -0.7208674 -0.0146603 0.0742523 -0.0162067 -0.6494938 0.4741179 -0.1255038 -0.0384009 -0.2268537 0.5165843 -0.0017814 -0.069235 0.0020238 0.4954178 0.2958803 0.0334414 0.0207165 0.0261621 0.1213243 0.0640364 0.0190708 0.0641654 -0.0762483 -0.0654822 -0.0623085 0.0498261 0.0412014 -0.0778545 0.0441426 -0.0169666 0.0897923 -0.0891664 -0.0638427 -0.022376 -0.0718009 0.0268653 -0.0201348 0.0033058 0.0406511 -0.0462466 -0.1481675 -0.311174 0.1401275 0.0356805 0.1792077 -0.2478421 -0.0325227 0.0475659 -0.033623 -0.1302677 -0.3659368 -0.1802131 -0.059561 -0.1745897 -0.2449529 -0.0480595 -0.0588466 -0.0478059 -0.1112014 0.5813287 0.4237423 0.1394623 0.4660111 0.93407 0.29539 0.1519003 0.294266 0.051055 0.545942 -0.3677639 -0.0921236 -0.4596284 0.9291443 0.273205 -0.1189863 0.2757401 0.0290617 -0.2234957 -0.004787 -0.0048136 -0.0018617 -0.5205248 -0.1242719 -0.0038106 -0.1244856 -0.130405 -0.2309267 -0.0149339 0.0131164 0.0083608 0.0771505 0.01878 -0.0050584 0.0244298 0.081566 0.0978026 0.0843723 0.0234369 0.0670392 -0.1050987 -0.0227396 0.013592 -0.0581363 0.0730146 0.0973906 -0.0210966 -0.069055 -0.0094499 0.0748925 -0.0483949 -0.0495001 -0.0114874 -0.1017201 -0.2300478 0.0010819 -0.0329256 0.0106573 0.0979549 -0.0071529 -0.0054984 -0.0141032 0.0589965 0.0976202 0.0822548 0.0264973 0.0638721 -0.0911767 -0.08034 0.026068 -0.043718 0.0597249 0.0913786 -0.0605327 0.0535961 -0.0418251 -0.0036699 0.1090835 0.0431894 0.0708647 -0.0175342 0.0650998 -0.0736116 -0.0235506 -0.082878 0.0176691 -0.0400774 -0.026416 -0.0398248 0.1364957 0.1877161 0.0217169 0.0070716 0.0271675 0.0701835 -0.0259207 0.0083181 -0.0261549 0.154753 -0.018528 -0.0338799 -0.0238686 -0.1242151 0.316363 -0.0245103 -0.0505941 -0.021451 0.3784237 0.0138155 0.002381 -0.003468 0.002345 0.1158734 -0.0180327 -0.0035302 -0.0181148 0.1726997 unknown
polarizability: 146.398429|1.5074154|137.6365709|2.5600266|21.1579991|71.2674099 unknown
InChI: InChI=1S/C9H10Cl2O/c1-9(2,12)6-3-7(10)5-8(11)4-6/h3-5,12H,1-2H3
charge 0 multiplicity 1
22 atoms
Cl 2.471283 2.648003 0.797338
Cl 2.431248 -2.686133 -0.757584
O  -2.514733 1.405943 0.315486
C  -2.114116 0.034058 -0.081327
C  -0.57745 0.025533 -0.044191
C  -2.694857 -0.974742 0.941364
C  -2.631695 -0.244237 -1.514936
C  0.127403 -1.161461 -0.371105
C  0.141244 1.191488 0.313215
C  1.546711 1.144736 0.335725
C  1.532408 -1.1553 -0.334028
C  2.279635 -0.014331 0.016984
H  -3.801248 -0.957946 0.912034
H  -2.36894 -2.007711 0.726363
H  -2.364703 -0.710228 1.960205
H  -3.738476 -0.226788 -1.534104
H  -2.305624 -1.232927 -1.882898
H  -2.254501 0.527028 -2.207722
H  -0.401132 -2.077545 -0.650552
H  -0.407462 2.100448 0.563814
H  -3.503195 1.460482 0.29633
H  3.371399 -0.028872 0.04049
