program: Gaussian 09
title: 000110597
version: EM64L-G09RevD.01
frameworkgroup: C1[X(C17H19NO3)]
method: RPBEPBE
basis: SDD
operation: Freq
keyword: #p
keyword: freq=noraman
keyword: PBEPBE/SDD
title: #p freq=noraman PBEPBE/SDD
converged: YES YES NO NO
title: Mulliken charges:
elementType: O O O N C C C C C C C C C C C C C C C C C H H H H H H H H H H H H H H H H H H H
charge: -0.260002 -0.311007 -0.251569 -0.676790 0.180357 0.250415 0.197845 -0.493986 0.330750 -0.563758 -0.004611 0.361828 -0.243340 -0.228964 -0.352531 -0.371835 -0.252465 -0.239742 -0.684833 -0.691907 -0.238492 0.287251 0.240110 0.201535 0.207822 0.212094 0.217285 0.245030 0.265246 0.304653 0.342015 0.224291 0.225489 0.202262 0.234642 0.240345 0.213636 0.227208 0.227975 0.225749
chargesum: 0.00000
title: Mulliken charges with hydrogens summed into heavy atoms:
elementType: O O O N C C C C C C C C C C C C C C C C C
charge: -0.260002 -0.311007 -0.251569 -0.030122 0.180357 0.250415 0.197845 -0.206735 0.330750 -0.323648 -0.004611 0.361828 0.166017 0.200414 -0.107501 -0.106589 -0.028174 -0.014253 -0.007584 -0.023088 -0.012743
polarizability: 3.18956858e+02 2.13261240e+01 2.07319231e+02 2.19638085e+00 2.35250548e+01 1.36143773e+02
1716.lowfreq: -6.9824 -5.6641 -2.1120 -0.0006 -0.0004 0.0007 29.6294 32.9910 42.6641
frequency: 29.5972 32.9740 42.6496 57.7550 79.4886 97.4046 100.8531 104.7358 111.5055 124.4029 168.1309 192.3074 205.4721 243.3121 243.8061 247.5525 251.0596 265.3931 309.1209 331.9752 357.2391 372.5297 397.1049 405.2608 418.6565 446.1476 448.5392 512.2313 526.7279 546.3550 590.4091 613.2840 620.6302 666.8018 670.5909 698.4820 713.6841 722.0719 736.4764 776.9591 804.2260 817.2686 823.6583 839.2655 855.3465 870.8918 886.7950 899.5735 937.3145 949.2661 981.2911 990.0953 996.3975 1024.1725 1031.6348 1041.1895 1054.1744 1080.2607 1111.5316 1115.8893 1116.4515 1133.6509 1139.0022 1170.4355 1179.9551 1183.6823 1187.9895 1255.0259 1260.9228 1261.3935 1275.6978 1313.6175 1323.8714 1359.2714 1373.6778 1383.6371 1398.1359 1398.8079 1415.5123 1428.8686 1435.9998 1459.4562 1462.8005 1477.0386 1478.1652 1478.8357 1489.6645 1490.6143 1509.3091 1530.0727 1578.0620 1588.9176 1607.2832 1608.8387 1634.5492 2946.9062 2961.2361 2994.9465 2996.9260 3004.6292 3018.7024 3093.2231 3094.4132 3101.2337 3107.2232 3120.1432 3131.7826 3144.9991 3153.5647 3154.5239 3164.0233 3165.0212 3555.2718 3705.0598
redmass: 5.4485 3.5969 4.2944 3.9788 3.6746 3.4918 3.1620 2.0384 2.0442 4.4317 5.5007 5.1173 4.6050 1.2565 1.4004 3.2270 3.8460 3.9985 3.1614 4.7730 3.3888 1.7326 4.2862 2.9096 3.6889 2.7764 4.5040 4.0554 1.1081 5.3300 6.7549 6.2647 5.6769 5.6795 5.6216 1.9251 3.0359 4.3805 2.2484 3.8639 2.5889 1.5030 1.1687 1.3693 1.2499 2.8911 1.6722 2.9252 1.5037 3.4732 1.3960 5.9801 1.3311 2.3215 2.5769 2.9057 1.5567 1.5897 3.8510 2.3047 2.1884 1.4305 1.4493 1.0554 2.2070 1.2537 3.6167 2.7450 1.1472 1.1364 1.6457 1.3773 3.8280 1.3905 1.3576 9.0657 1.3054 1.2838 3.6695 2.9968 3.7083 1.0396 1.0407 1.3090 1.6803 1.0526 1.1034 1.0833 10.8366 3.8084 7.4478 6.2719 3.0837 2.1537 2.8952 1.0550 1.0558 1.0360 1.0363 1.1074 1.1075 1.0989 1.0990 1.1014 1.1013 1.0846 1.0882 1.0927 1.0901 1.0961 1.0909 1.1002 1.0446 1.1043
irintensity: 3.7534 0.4142 0.2974 0.9270 1.2783 1.7939 2.8906 3.0934 1.0907 1.9570 5.2837 0.4321 1.0297 0.0484 0.7623 2.7334 3.1045 0.2738 1.3929 3.8740 25.2342 99.8117 7.6008 1.2923 46.5612 0.9747 4.4209 12.5569 109.0158 2.1348 23.5967 0.2035 3.9943 1.6924 31.2309 36.0957 31.0583 4.3099 32.2894 31.1153 21.2862 45.9658 2.2294 8.9031 1.6740 5.3359 11.1735 57.0198 9.7227 34.0967 1.7699 0.6502 1.1251 10.2598 57.9008 106.8201 3.6458 15.7556 7.0330 3.5459 0.6381 4.4108 4.6476 0.1477 338.6813 44.0599 80.2439 30.7877 0.1097 0.7240 263.5493 8.0161 391.3548 35.3544 15.7680 2.9987 51.9277 2.5090 11.9256 36.9786 136.0939 12.6014 12.1377 28.9369 9.5278 5.5440 14.4862 2.1560 226.1945 143.0781 53.5974 17.7351 13.2089 19.0554 468.7320 48.8310 28.0744 28.2168 22.5999 35.4941 28.9416 26.0509 29.3678 37.8839 27.2713 0.3271 8.5749 29.2008 14.5668 24.9538 15.5739 18.4496 147.2285 38.0668
temp: 298.150 k
press: 1.00000 atm
elementType: 8 8 8 7 6 6 6 6 6 6 6 6 6 6 6 6 6 6 6 6 6 1 1 1 1 1 1 1 1 1 1 1 1 1 1 1 1 1 1 1
symmnumber: 1
zpe: 846914.0 jmol-1
zpe.correction: 0.322573 hartree
zpe.thermalcorrener: 0.343397 hartree
zpe.thermalcorrenthalpy: 0.344341 hartree
zpe.thermalcorrgfe: 0.272112 hartree
zpe.sumelectzpe: -938.089356 hartree
zpe.sumelectthermal: -938.068531 hartree
zpe.sumelectthermalent: -938.067587 hartree
zpe.sumelectthermalfe: -938.139817 hartree
dipole: 2.2358 4.9188 2.0532
dipole: 5.7801
quadrupole: -97.4459 -111.1465 -125.9623
quadrupole: -3.0017 0.4274 -0.6532
quadrupole: 14.0723 0.3717 -14.4440 -3.0017 0.4274 -0.6532
hfenergy: -938.4119282 hartree
pointgroup: C01 [X(C17H19N1O3)]
dipole: 1.1303168 -1.4889823 -1.2948605 debye
polarizability: 322.6104852|-3.967545|185.2327159|-6.8004228|37.8772818|154.5766612 unknown
InChI: InChI=1S/C17H19NO3/c1-3-20-15-11-14(18)16(21-4-2)10-13(15)17(19)12-8-6-5-7-9-12/h5-11H,3-4,18H2,1-2H3
charge 0 multiplicity 1
40 atoms
O  -0.983897 -1.633675 -0.321626
O  4.027084 0.950456 -0.240475
O  -0.689517 1.984332 1.589953
N  3.85882 -1.512784 -1.234893
C  0.29116 0.365445 0.121083
C  0.25218 -0.974293 -0.376375
C  2.730116 0.389484 -0.249512
C  1.563352 1.00718 0.201455
C  2.679851 -0.938395 -0.788978
C  1.432714 -1.610355 -0.830842
C  -0.872605 1.132754 0.653837
C  -2.247408 1.003436 0.055909
C  -1.074266 -3.018956 -0.817215
C  4.168814 2.305878 0.323221
C  -2.445343 0.715862 -1.319251
C  -3.372243 1.287196 0.873044
C  -3.746309 0.704564 -1.86544
C  -4.674957 1.253445 0.33374
C  -2.530512 -3.445761 -0.64745
C  5.645307 2.680693 0.231043
C  -4.865785 0.963384 -1.038782
H  1.572916 2.010015 0.638106
H  1.405502 -2.638481 -1.203785
H  -0.765625 -3.054313 -1.88307
H  -0.392101 -3.667533 -0.228893
H  3.535859 3.008576 -0.256318
H  3.816049 2.301312 1.374539
H  -1.578472 0.517184 -1.958399
H  -3.200651 1.539112 1.924856
H  3.879886 -2.449954 -1.623977
H  4.718935 -0.97522 -1.154962
H  -3.889725 0.499572 -2.932616
H  -5.538879 1.460082 0.97548
H  -2.669418 -4.479641 -1.013208
H  -2.824871 -3.405232 0.41485
H  -3.198031 -2.774884 -1.214339
H  5.803031 3.694125 0.642367
H  5.9865 2.674383 -0.81858
H  6.265916 1.971783 0.805816
H  -5.876877 0.947723 -1.462112
