program: Gaussian 09
title: 000110559
version: EM64L-G09RevD.01
frameworkgroup: C1[X(C10H13F11N2O2S)]
method: RPBEPBE
basis: SDD
operation: Freq
keyword: #p
keyword: freq=noraman
keyword: PBEPBE/SDD
title: #p freq=noraman PBEPBE/SDD
converged: YES YES NO NO
title: Mulliken charges:
elementType: S F F F F F F F F F F F O O N N C C C C C C C C C C H H H H H H H H H H H H H
charge: 1.035010 -0.114913 -0.139585 -0.115185 -0.139065 -0.120902 -0.121168 -0.115520 -0.126181 -0.124749 -0.122502 -0.130848 -0.491922 -0.495696 -0.560417 -0.105340 0.261867 0.119474 0.283347 0.213369 -0.354974 -0.365600 -0.348464 0.374780 -0.621671 -0.616216 0.294226 0.245823 0.341355 0.210461 0.203618 0.200967 0.233410 0.262921 0.187974 0.219733 0.217436 0.230761 0.194383
chargesum: 0.00000
title: Mulliken charges with hydrogens summed into heavy atoms:
elementType: S F F F F F F F F F F F O O N N C C C C C C C C C C
charge: 1.035010 -0.114913 -0.139585 -0.115185 -0.139065 -0.120902 -0.121168 -0.115520 -0.126181 -0.124749 -0.122502 -0.130848 -0.491922 -0.495696 -0.219062 -0.105340 0.261867 0.119474 0.283347 0.213369 0.185075 0.048479 0.085913 0.374780 0.048958 0.026364
polarizability: 2.80302103e+02 -4.56666387e+01 1.79583691e+02 3.08481154e+00 2.38461731e-01 1.46236202e+02
1716.lowfreq: -9.4949 -4.2529 -3.6404 -0.0014 -0.0013 -0.0009 9.8921 14.0275 24.0683
frequency: 9.7253 13.9913 24.0372 27.5004 42.3409 48.8011 53.5131 64.9552 78.0909 93.3632 101.6262 115.3159 121.7496 135.8689 137.8107 155.8417 170.3349 175.6183 195.9161 216.2004 222.4207 226.0564 234.0243 238.1046 247.4127 255.8812 273.7467 275.8160 286.2407 290.1601 301.0047 307.7680 316.2471 328.9559 363.3598 381.1079 382.5880 402.5479 403.7043 407.3436 420.1562 425.6675 433.9160 461.6570 514.5973 517.4708 535.2920 553.9823 572.8144 587.0339 653.9270 678.4283 735.1542 773.3418 829.5246 837.3260 849.5471 878.0196 923.0602 943.9944 968.7166 972.9335 982.8616 992.8768 1022.4143 1032.1358 1036.9666 1044.4511 1050.1985 1051.3823 1066.8291 1074.7666 1078.4803 1084.8218 1091.3597 1114.3246 1131.5370 1142.0047 1157.1024 1169.6713 1193.9908 1197.4365 1259.3019 1270.0582 1293.0114 1329.7861 1336.4064 1357.4290 1362.6072 1420.9403 1439.4255 1450.3769 1464.5932 1466.4473 1470.3145 1474.1996 1479.2442 1485.2816 2859.8601 2870.6371 2887.3187 2972.6083 2990.7363 3023.9818 3028.1661 3037.6410 3044.3348 3053.8932 3079.5267 3090.2158 3470.6748
redmass: 6.1483 6.2740 6.2946 7.2970 8.6570 4.9002 15.5590 3.3128 12.6417 14.1343 4.0160 12.3286 12.1837 8.4366 9.0634 11.9685 3.4479 8.4824 13.0539 11.4097 1.1521 1.6088 9.6214 2.2422 9.1506 12.2171 13.6769 7.5971 7.4549 15.0308 14.8155 2.5780 17.6189 18.1467 2.8170 6.0775 2.6009 12.6781 2.7445 4.6187 3.2449 3.5557 15.4664 17.7837 15.8777 2.3200 15.5211 16.4382 17.1352 17.5463 16.7021 2.2820 2.5199 11.0220 3.7978 3.3115 14.0369 2.6461 12.9013 1.8756 10.3153 9.7915 12.2766 2.5475 13.0759 12.8204 1.7556 1.9900 12.4990 11.6222 1.9604 11.7911 2.8359 12.3849 1.3293 10.0018 1.4946 9.4825 1.6027 11.0225 12.1405 1.2355 1.5339 2.4553 1.3503 1.2697 1.3414 1.2152 1.3239 1.1404 1.1440 1.0922 1.0463 1.0830 1.0711 1.0624 1.0589 1.0526 1.0564 1.0574 1.0677 1.0568 1.0614 1.0730 1.0760 1.0946 1.1037 1.0976 1.1006 1.1006 1.0772
irintensity: 0.1501 0.1593 0.1446 0.9082 0.0788 0.2317 0.5190 4.8351 0.6436 0.5394 4.6793 1.2140 1.6771 1.0138 2.4255 7.2651 3.9638 2.8400 12.7271 5.9157 0.4265 0.8963 1.9141 0.8938 0.5499 3.0415 0.1265 8.6351 8.4975 1.0116 0.3692 5.3412 1.1690 1.2300 22.1075 6.0514 25.3994 67.7271 10.5315 2.9260 47.0712 32.1262 18.5779 10.1563 0.9953 9.1646 6.9165 14.2005 6.9196 2.2311 34.7043 8.4420 18.7284 73.5749 102.2377 51.9172 86.9730 6.0798 96.0576 24.7514 63.3697 57.1002 45.1931 62.8439 61.7875 52.1920 16.8664 18.6440 63.9274 140.1515 27.1899 149.4950 13.4311 452.3624 3.0107 217.9181 38.4494 71.3009 26.0169 99.6069 39.7914 13.1301 3.6486 5.4747 11.0452 14.1882 5.9143 13.8866 4.6423 2.1067 15.3196 6.8885 7.0965 5.2138 16.6019 35.7277 21.4118 8.1933 145.3043 178.5103 312.0021 40.5523 37.8382 39.5539 29.2535 5.7974 32.4342 27.5896 28.5380 13.3979 52.6984
temp: 298.150 k
press: 1.00000 atm
elementType: 16 9 9 9 9 9 9 9 9 9 9 9 8 8 7 7 6 6 6 6 6 6 6 6 6 6 1 1 1 1 1 1 1 1 1 1 1 1 1
symmnumber: 1
zpe: 638077.8 jmol-1
zpe.correction: 0.243031 hartree
zpe.thermalcorrener: 0.272871 hartree
zpe.thermalcorrenthalpy: 0.273815 hartree
zpe.thermalcorrgfe: 0.178674 hartree
zpe.sumelectzpe: -2142.802973 hartree
zpe.sumelectthermal: -2142.773133 hartree
zpe.sumelectthermalent: -2142.772189 hartree
zpe.sumelectthermalfe: -2142.867330 hartree
dipole: -4.8446 -0.1135 -3.3847
dipole: 5.9110
quadrupole: -139.5713 -159.3829 -163.3975
quadrupole: 2.9542 6.5180 5.8647
quadrupole: 14.5459 -5.2657 -9.2803 2.9542 6.5180 5.8647
hfenergy: -2143.0460042 hartree
pointgroup: C01 [X(C10H13F11N2O2S1)]
dipole: 1.8555133 0.0606031 1.4005713 debye
polarizability: 282.2319943|43.5638502|177.1533813|3.1331793|-2.1818282|146.73662 unknown
InChI: InChI=1S/C5F11.C5H13N2O2S/c6-1(7)2(8,9)3(10,11)4(12,13)5(14,15)16;1-7(2)5-3-4-6-10(8)9/h;6H,3-5H2,1-2H3
charge 0 multiplicity 1
39 atoms
S  1.269909 -1.297211 -0.596234
F  -1.82307 -2.664574 0.054952
F  -2.685666 -1.093087 1.472611
F  -0.217094 0.371023 1.228533
F  0.004444 -1.80303 1.88107
F  -1.535173 -0.749731 -1.96396
F  -3.638242 -1.146501 -1.15032
F  -1.424352 1.708786 -0.833143
F  -3.328278 1.34138 -2.037307
F  -4.711135 0.900663 0.521564
F  -3.882877 2.949849 0.016014
F  -2.822778 1.658861 1.540654
O  1.542276 0.152419 -1.252181
O  0.947308 -2.633204 -1.443654
N  2.651627 -1.682927 0.472201
N  4.920634 1.384406 -0.094855
C  -1.792321 -1.287524 0.370025
C  -0.347687 -0.957427 0.807678
C  -2.402115 -0.52453 -0.86586
C  -2.662445 1.034372 -0.827112
C  3.226101 -0.651342 1.36342
C  4.77012 -0.697162 1.281987
C  5.264932 -0.055477 -0.034241
C  -3.535045 1.63419 0.336218
C  4.621799 1.875728 -1.457852
C  5.885172 2.245198 0.617347
H  2.923952 0.350615 0.999013
H  2.861567 -0.784107 2.400017
H  2.574224 -2.65173 0.812982
H  5.169565 -0.145364 2.155473
H  5.137784 -1.738847 1.359959
H  6.363598 -0.226986 -0.143565
H  4.772613 -0.570709 -0.879101
H  3.813682 1.268511 -1.898928
H  5.507271 1.855047 -2.140719
H  4.2637 2.919558 -1.400071
H  6.028757 1.889726 1.653186
H  5.496187 3.277846 0.668053
H  6.889155 2.277695 0.123247
