program: Gaussian 09
title: 000110558
version: EM64L-G09RevD.01
frameworkgroup: C1[X(C9H13F9N2O2S)]
method: RPBEPBE
basis: SDD
operation: Freq
keyword: #p
keyword: freq=noraman
keyword: PBEPBE/SDD
title: #p freq=noraman PBEPBE/SDD
converged: YES YES NO NO
title: Mulliken charges:
elementType: S F F F F F F F F F O O N N C C C C C C C C C H H H H H H H H H H H H H
charge: 1.034776 -0.118812 -0.138013 -0.132892 -0.119278 -0.126703 -0.120987 -0.128724 -0.119626 -0.124226 -0.491301 -0.495371 -0.561905 -0.105885 0.125686 0.279113 -0.351565 0.236126 -0.370100 -0.346390 0.373599 -0.616026 -0.618728 0.244593 0.295755 0.211671 0.202564 0.340655 0.200426 0.233361 0.193996 0.230517 0.217500 0.188156 0.257959 0.220080
chargesum: 0.00000
title: Mulliken charges with hydrogens summed into heavy atoms:
elementType: S F F F F F F F F F O O N N C C C C C C C C C
charge: 1.034776 -0.118812 -0.138013 -0.132892 -0.119278 -0.126703 -0.120987 -0.128724 -0.119626 -0.124226 -0.491301 -0.495371 -0.221250 -0.105885 0.125686 0.279113 0.188783 0.236126 0.044135 0.087397 0.373599 0.025987 0.047467
polarizability: 2.60504460e+02 2.87210617e+01 1.53377123e+02 -4.63029251e+00 -1.47651630e+00 1.37151705e+02
1716.lowfreq: -7.0073 -3.8724 -0.0012 -0.0004 0.0003 5.6552 11.4409 16.2590 22.1823
frequency: 11.4202 16.0557 22.1167 29.7735 32.9552 47.9011 62.4210 75.9785 87.6558 101.0994 118.9929 128.5511 133.9436 147.7771 170.1987 177.8589 202.5085 212.4390 216.9718 227.1820 235.9511 240.7356 249.6612 271.2139 280.5233 286.7343 295.2245 305.1235 314.5754 329.6776 360.1172 382.1036 397.0047 403.0296 404.3743 414.1119 422.9890 430.0456 462.7382 507.1565 518.8767 548.4800 555.8373 582.0453 653.3742 680.8687 736.3645 778.9580 832.1923 838.9712 874.1998 880.5923 945.4072 955.4035 971.0919 985.0855 993.6325 1024.7308 1036.6445 1037.5929 1045.8137 1052.4396 1067.2226 1075.8882 1078.4930 1083.2567 1090.7782 1125.0405 1132.8753 1158.3339 1168.0884 1191.2697 1196.2763 1260.3628 1270.5665 1292.5253 1328.2922 1338.8919 1356.4552 1362.5811 1420.7855 1439.7519 1453.3478 1463.9950 1466.8564 1470.1948 1474.0310 1478.8933 1485.3768 2858.8939 2869.5834 2887.1261 2972.4405 2991.3571 3023.6513 3028.4147 3036.8730 3044.2098 3053.7900 3079.1891 3089.0493 3468.6640
redmass: 6.7827 5.5394 6.5628 7.4350 14.1886 4.6914 3.2083 13.0403 15.2502 3.7802 9.9026 8.6000 8.3460 12.3120 2.9677 9.4261 14.6250 1.1542 7.0381 1.6193 3.3957 4.9889 8.2388 6.3035 15.0646 7.6736 17.9431 2.5980 12.0423 15.3518 2.8235 2.1563 14.5677 5.2718 2.7952 8.9028 2.1370 8.2071 17.8236 16.6972 2.2660 16.8018 16.2269 17.3915 16.3607 2.3492 2.5179 11.0856 3.0838 3.9675 5.5754 3.7243 1.8818 13.2036 8.1003 9.9342 2.6240 13.4496 8.9817 1.7727 2.1104 11.8042 1.9766 12.1928 2.7671 9.5515 1.3625 6.2016 1.5864 1.6043 11.0571 11.9716 1.2315 1.5107 2.4449 1.3725 1.2776 1.3304 1.2199 1.3364 1.1390 1.1497 1.0882 1.0456 1.0840 1.0730 1.0573 1.0605 1.0533 1.0565 1.0575 1.0677 1.0568 1.0615 1.0728 1.0756 1.0945 1.1039 1.0977 1.1005 1.1007 1.0771
irintensity: 0.2364 0.2723 0.3499 0.3050 0.3377 0.3455 3.4288 0.8801 0.1045 5.6431 0.7594 3.7102 1.5587 3.4294 2.7064 2.6671 6.7281 1.2330 3.6266 0.4533 0.8216 4.2919 0.7811 7.5112 0.2557 6.7492 0.9647 6.4891 3.8118 2.8334 23.7363 17.9726 22.1488 26.1190 34.2817 15.9665 11.4595 84.2274 6.8659 3.3561 7.8531 3.2691 12.5267 4.5710 27.8744 7.3499 19.7467 53.5705 66.6988 52.1337 78.3219 53.4945 19.4178 53.2140 34.8061 59.0288 51.4312 70.1638 80.9359 30.2869 11.5827 70.5372 17.2972 262.4243 34.7649 277.1281 2.4576 258.9845 11.3870 28.2206 113.2181 44.8422 19.0571 2.2264 5.3527 9.2882 14.8326 8.7900 13.3162 4.0492 2.8979 10.0668 7.1552 9.2524 3.1192 13.7653 32.9335 21.4582 9.4102 132.1656 171.2171 282.3322 37.9066 40.2271 39.9966 25.5854 5.7862 29.5663 27.5847 28.2948 16.0730 48.6001
temp: 298.150 k
press: 1.00000 atm
elementType: 16 9 9 9 9 9 9 9 9 9 8 8 7 7 6 6 6 6 6 6 6 6 6 1 1 1 1 1 1 1 1 1 1 1 1 1
symmnumber: 1
zpe: 609372.7 jmol-1
zpe.correction: 0.232098 hartree
zpe.thermalcorrener: 0.258970 hartree
zpe.thermalcorrenthalpy: 0.259914 hartree
zpe.thermalcorrgfe: 0.171095 hartree
zpe.sumelectzpe: -1905.253512 hartree
zpe.sumelectthermal: -1905.226640 hartree
zpe.sumelectthermalent: -1905.225696 hartree
zpe.sumelectthermalfe: -1905.314515 hartree
dipole: 4.9533 -1.4475 -2.7505
dipole: 5.8477
quadrupole: -127.6210 -138.6943 -148.3695
quadrupole: -5.2784 -2.6557 3.6899
quadrupole: 10.6073 -0.4660 -10.1412 -5.2784 -2.6557 3.6899
hfenergy: -1905.4856099 hartree
pointgroup: C01 [X(C9H13F9N2O2S1)]
dipole: 1.8260684 -0.1751391 -1.3884658 debye
polarizability: 261.9759157|25.9952136|150.8375527|-4.8568083|1.9997855|138.2198199 unknown
InChI: InChI=1S/C5H13N2O2S.C4F9/c1-7(2)5-3-4-6-10(8)9;5-1(6)2(7,8)3(9,10)4(11,12)13/h6H,3-5H2,1-2H3;
charge 0 multiplicity 1
36 atoms
S  0.66427 -1.089915 0.570424
F  -0.650631 0.626671 -1.34059
F  -0.724786 -1.599963 -1.831811
F  -3.27524 -0.499183 -1.422885
F  -2.60711 -2.075463 0.091184
F  -4.187045 -0.158646 1.151066
F  -2.058098 -0.132758 1.9958
F  -3.358848 2.132943 -0.546884
F  -1.487218 2.221707 0.73965
F  -3.530868 2.354733 1.703621
O  1.102525 0.343436 1.169018
O  0.207199 -2.349751 1.470589
N  1.977177 -1.662389 -0.500537
N  4.677024 1.016788 -0.013193
C  -0.932049 -0.642908 -0.817407
C  -2.394023 -0.740976 -0.325433
C  2.654067 -0.725788 -1.424071
C  -2.84759 0.184934 0.865838
C  4.176334 -0.998737 -1.406731
C  4.812659 -0.455334 -0.106692
C  -2.799137 1.747502 0.67791
C  5.719512 1.748144 -0.75911
C  4.509676 1.518978 1.368015
H  2.231487 -0.802886 -2.444386
H  2.517276 0.308087 -1.050064
H  4.617309 -0.500818 -2.292422
H  4.384719 -2.081964 -1.507173
H  1.780979 -2.62246 -0.817973
H  5.879786 -0.781619 -0.048421
H  4.287893 -0.911731 0.752255
H  6.740767 1.626166 -0.316992
H  5.479806 2.826351 -0.772514
H  5.760297 1.400782 -1.80678
H  5.408506 1.354189 2.012822
H  3.639057 1.028882 1.835641
H  4.307316 2.604898 1.340333
