program: Gaussian 09
title: 000110556
version: EM64L-G09RevD.01
frameworkgroup: C1[X(C9H8F13NO3S)]
method: RPBEPBE
basis: SDD
operation: Freq
keyword: #p
keyword: freq=noraman
keyword: PBEPBE/SDD
title: #p freq=noraman PBEPBE/SDD
converged: YES YES NO NO
title: Mulliken charges:
elementType: S F F F F F F F F F F F F F O O O N C C C C C C C C C H H H H H H H H
charge: 1.020618 -0.118493 -0.136266 -0.126987 -0.114970 -0.143280 -0.112159 -0.117027 -0.119522 -0.123421 -0.125241 -0.122010 -0.121362 -0.125785 -0.489077 -0.493353 -0.447470 -0.355027 0.262279 0.270847 0.118012 0.261766 0.206916 -0.321638 0.373325 -0.600030 -0.291446 0.245764 0.252040 0.274031 0.248820 0.264668 0.226772 0.223888 0.354820
chargesum: 0.00000
title: Mulliken charges with hydrogens summed into heavy atoms:
elementType: S F F F F F F F F F F F F F O O O N C C C C C C C C C
charge: 1.020618 -0.118493 -0.136266 -0.126987 -0.114970 -0.143280 -0.112159 -0.117027 -0.119522 -0.123421 -0.125241 -0.122010 -0.121362 -0.125785 -0.489077 -0.493353 -0.092650 -0.355027 0.262279 0.270847 0.118012 0.261766 0.206916 0.176166 0.373325 0.187490 0.159213
polarizability: 2.09398487e+02 -5.43252173e+00 1.41762200e+02 -2.62468924e+00 1.54534438e+00 1.33084132e+02
1716.lowfreq: -12.1501 -8.9454 -4.7269 -0.0013 0.0009 0.0016 3.0692 12.6432 19.5350
frequency: -10.7744 11.6616 19.4950 24.6486 38.0479 45.7289 59.0486 72.2639 85.6071 94.7261 104.2492 111.2484 128.6909 132.7817 150.8085 153.5452 161.5447 177.8600 192.0092 195.4982 201.2825 211.6707 224.8188 238.2875 244.4195 259.9848 263.9489 276.1861 280.1883 285.8432 293.3398 296.6912 304.1448 314.7231 329.7047 330.7574 359.1020 376.4926 388.6135 398.3910 405.5969 417.3619 441.6366 462.7947 485.9089 509.7869 513.1297 536.8266 554.3972 561.5162 583.7514 588.0642 654.5833 763.4756 812.8314 827.5645 836.8224 860.2529 894.0455 922.5617 948.9763 970.8824 981.7320 985.5143 1002.9627 1014.9350 1032.3305 1038.6933 1043.6437 1045.3165 1053.7404 1076.5709 1084.9696 1087.4391 1107.9854 1130.2376 1132.3636 1148.2950 1163.8622 1176.2247 1192.4970 1207.4762 1289.6368 1335.9619 1342.0147 1374.5904 1414.0058 1434.8289 1455.7622 1466.2175 1476.7176 2974.3906 2992.3181 2998.6036 3059.7636 3067.7498 3084.4664 3111.7250 3574.8325
redmass: 8.5181 8.2423 8.1725 12.9695 4.7874 9.8524 17.4300 9.9145 5.8427 3.7947 10.3916 15.7274 14.0238 17.2505 5.3105 4.6219 17.2152 8.8596 17.2080 4.3650 1.3503 13.3652 11.4164 13.5368 14.4030 9.7602 16.8623 5.1044 17.7935 10.4670 3.4435 17.7451 14.7910 17.4877 1.3919 18.4422 10.0393 4.5164 4.2280 14.6787 14.3539 17.1192 17.4171 17.7870 3.2437 3.6663 17.6007 13.1394 16.2199 16.9504 17.5177 17.5766 17.2131 12.2045 3.9749 11.2187 15.2178 1.8769 13.3397 2.9198 13.4961 16.0366 14.4061 13.4250 2.5843 13.2081 12.9106 9.2684 2.0640 9.9850 12.2324 12.9970 6.1893 1.7879 12.3116 1.6476 9.8339 11.9681 9.0485 2.0552 12.2831 1.7508 1.2577 1.2162 1.2010 1.1985 1.1210 1.0830 1.0845 1.0548 1.0465 1.0344 1.0581 1.0619 1.1032 1.1004 1.1054 1.1008 1.0664
irintensity: 0.5612 1.8121 1.8731 1.8256 5.4196 0.1671 0.5151 1.7662 9.0702 6.2321 2.9731 0.7997 0.8192 0.7691 11.5448 17.1942 0.9925 1.2817 15.5702 1.8713 6.1673 8.7593 3.5602 0.3664 1.0401 3.0521 0.9588 30.9754 2.1160 4.2440 8.9235 0.0810 0.4204 1.7155 177.3158 0.4031 6.9537 37.5935 2.1266 111.8550 7.0459 12.0511 3.8533 7.8637 6.4897 35.4515 1.0136 5.4597 20.5981 6.5372 8.2229 0.2778 41.5531 114.0504 24.6602 160.3694 49.2593 14.0574 79.5650 54.3289 86.8038 9.1535 67.0506 46.8925 148.3632 109.4202 78.2219 80.5664 28.8690 61.1271 69.2043 315.9706 251.2936 81.6633 45.6048 7.3850 74.6243 25.2926 53.3459 9.1272 53.7650 29.3163 13.2012 14.7432 1.1997 19.6742 24.6973 14.9328 4.1099 15.7807 15.4808 22.5514 16.9793 30.9344 6.4673 9.9301 23.0283 2.6030 16.5474
temp: 298.150 k
press: 1.00000 atm
elementType: 16 9 9 9 9 9 9 9 9 9 9 9 9 9 8 8 8 7 6 6 6 6 6 6 6 6 6 1 1 1 1 1 1 1 1
symmnumber: 1
zpe: 487784.5 jmol-1
zpe.correction: 0.185787 hartree
zpe.thermalcorrener: 0.215223 hartree
zpe.thermalcorrenthalpy: 0.216167 hartree
zpe.thermalcorrgfe: 0.123470 hartree
zpe.sumelectzpe: -2321.787044 hartree
zpe.sumelectthermal: -2321.757608 hartree
zpe.sumelectthermalent: -2321.756664 hartree
zpe.sumelectthermalfe: -2321.849361 hartree
dipole: 2.8391 -0.1893 -2.6428
dipole: 3.8834
quadrupole: -156.4037 -164.1921 -167.4716
quadrupole: 2.0831 -3.5369 -0.3730
quadrupole: 6.2854 -1.5030 -4.7825 2.0831 -3.5369 -0.3730
hfenergy: -2321.9728309 hartree
pointgroup: C01 [X(C9H8F13N1O3S1)]
dipole: -1.0927218 0.0592444 -1.0662014 debye
polarizability: 208.6254072|-8.2538844|142.1473038|4.4895208|-2.3903705|133.4721084 unknown
InChI: InChI=1S/C6F13.C3H8NO3S/c7-1(8)2(9,10)3(11,12)4(13,14)5(15,16)6(17,18)19;1-4(2-3-5)8(6)7/h;5H,2-3H2,1H3
charge 0 multiplicity 1
35 atoms
S  -2.434908 0.004697 0.753187
F  -0.163016 -2.405127 -0.190412
F  1.211511 -1.208021 -1.563719
F  2.192034 -1.876847 0.958575
F  0.447918 -0.790298 1.969466
F  -1.508161 -0.698154 -1.846992
F  -0.423333 1.121775 -1.014125
F  1.248836 1.618432 1.034376
F  2.843124 0.440948 2.163553
F  3.779445 2.143722 0.267908
F  2.532304 1.179169 -1.383217
F  5.309849 0.593422 -1.313343
F  5.072656 -0.405528 0.709488
F  3.967377 -1.216638 -1.10181
O  -2.197509 1.48329 1.362744
O  -2.4956 -1.338678 1.646902
O  -6.621078 1.258183 -0.425415
N  -3.97099 0.073361 -0.211921
C  0.372334 -1.113515 -0.411144
C  1.289433 -0.793481 0.831479
C  -0.825843 -0.184908 -0.721107
C  2.146062 0.53213 0.933811
C  3.206039 0.926265 -0.167512
C  -4.188488 1.308728 -1.006627
C  4.403469 -0.0511 -0.465019
C  -4.474621 -1.216661 -0.731301
C  -5.409477 2.083918 -0.460839
H  -4.342392 1.027092 -2.065299
H  -3.304098 1.971353 -0.946372
H  -4.307184 -2.005438 0.01986
H  -4.013154 -1.505921 -1.694753
H  -5.560979 -1.085972 -0.882446
H  -5.637909 2.916958 -1.148004
H  -5.168077 2.492126 0.539736
H  -6.614875 0.721018 0.406192
