program: Gaussian 09
title: 000110542
version: EM64L-G09RevD.01
frameworkgroup: C1[X(C13H22O2)]
method: RPBEPBE
basis: SDD
operation: Freq
keyword: #pfreq=noraman
keyword: PBEPBE/SDD
title: #p freq=noraman PBEPBE/SDD
converged: YES YES NO NO
title: Mulliken charges:
elementType: O O C C C C C C C C C C C C C H H H H H H H H H H H H H H H H H H H H H H
charge: -0.251227 -0.230114 -0.034342 -0.411279 -0.344741 -0.710331 -0.709848 -0.289175 -0.362486 -0.346703 -0.492724 -0.694016 0.182505 0.180743 -0.209738 0.206180 0.215084 0.215169 0.183585 0.221034 0.214515 0.211800 0.215648 0.211705 0.214363 0.215715 0.240580 0.239766 0.209845 0.201140 0.190221 0.197508 0.236055 0.244447 0.213842 0.215985 0.209288
chargesum: 0.00000
title: Mulliken charges with hydrogens summed into heavy atoms:
elementType: O O C C C C C C C C C C C C C
charge: -0.251227 -0.230114 0.171838 0.018974 0.059878 -0.068368 -0.068065 0.191171 0.048499 0.041026 -0.012222 -0.054900 0.182505 0.180743 -0.209738
polarizability: 2.05088599e+02 5.75385067e+00 1.41859406e+02 -9.51497690e-01 4.87004536e-01 1.12151791e+02
1716.lowfreq: -11.1452 -0.0008 -0.0004 -0.0002 4.6144 8.9160 12.8784 20.3186 23.3493
frequency: -6.9044 19.9668 23.1077 43.2876 60.0174 67.7199 99.1667 105.8724 109.9143 131.4708 167.2388 179.9140 218.0808 223.8239 228.0534 238.1279 241.7689 299.5528 332.1800 356.3128 370.2434 377.0402 384.6957 430.5482 526.8649 558.0580 588.4131 703.4088 731.3231 751.6860 777.7395 784.8086 810.7264 833.7940 881.9760 909.7799 913.7086 924.8744 950.5069 964.6454 970.8283 985.4995 1017.9415 1026.4861 1056.2166 1081.6817 1105.9882 1109.5707 1140.5199 1149.3269 1193.2658 1199.5524 1213.6540 1215.4765 1221.9817 1269.5253 1282.3713 1282.7095 1289.0631 1293.9360 1317.2376 1332.7160 1336.7380 1340.9189 1360.6959 1379.2718 1383.9836 1391.4090 1397.1908 1445.5683 1463.0142 1463.5165 1465.9260 1468.3769 1477.4835 1478.3395 1479.0103 1482.0540 1485.7677 1488.2444 1491.2501 1592.5381 2266.5691 2959.7429 2966.9340 2967.9496 2969.9279 2970.2999 2973.3165 2973.5454 2981.0849 2992.2473 3002.7182 3012.6740 3019.7316 3026.5799 3041.5165 3050.7703 3062.2546 3067.1613 3070.0415 3070.5677 3072.1309 3072.9277 3083.6944
redmass: 2.9128 4.1864 4.1247 4.2289 3.0978 1.9052 3.1260 2.0058 3.2411 2.9666 2.5677 3.0910 2.3838 1.2698 1.3473 1.2924 1.8627 4.5098 4.4738 2.0824 2.4041 2.8792 3.2243 4.0806 3.4963 3.8404 4.5529 11.3279 1.1553 2.8309 1.1630 1.6464 2.8596 1.6261 4.0014 1.7979 1.1948 1.9447 1.2741 1.9207 1.9599 1.7634 2.3321 2.8426 3.2699 2.2187 1.8080 1.7550 1.9889 1.7992 1.9376 1.4031 1.2036 1.6559 2.6389 1.2651 1.1166 1.2375 1.5952 1.0639 1.3811 1.4631 1.4034 1.3577 1.5880 1.2097 1.4697 1.2160 1.2264 1.0866 1.0868 1.0755 1.0451 1.0691 1.0499 1.0602 1.0549 1.0803 1.0513 1.0850 1.0550 12.0537 11.8755 1.0598 1.0602 1.0801 1.0354 1.0594 1.0362 1.0362 1.0618 1.0639 1.0967 1.0566 1.0989 1.1009 1.1021 1.1042 1.1000 1.1003 1.0987 1.1007 1.0988 1.0994 1.1077
irintensity: 0.3085 0.8628 0.8160 0.1687 0.9147 0.3221 1.3748 0.4283 1.4299 0.9309 2.2049 0.1372 0.4875 0.1845 0.2277 0.0774 0.6796 15.1284 0.5638 0.0293 1.0484 2.1052 0.8835 0.8757 1.7125 2.4720 8.1212 15.2980 14.4322 2.8026 1.8348 0.4399 2.7342 5.0002 5.1720 9.7829 2.5566 23.8149 0.0813 0.6046 16.5498 0.0662 58.0973 126.4090 110.7244 33.4928 6.3856 5.9953 6.7892 6.0666 18.1877 1.4097 1.0184 70.9366 286.2656 0.3388 0.3322 0.8339 16.6687 0.6932 26.6725 1.8546 6.0427 3.6895 8.6929 22.3563 0.4910 11.5646 15.5193 14.0982 5.9371 2.1517 1.1779 0.3465 10.0486 5.1163 3.2445 10.8623 11.7395 17.8793 19.4696 258.6163 203.8144 2.5441 36.4096 16.3767 37.9479 25.5268 19.2157 34.0393 65.7063 26.2382 3.8449 23.3978 12.2022 13.4285 6.3463 54.8100 20.4555 11.4638 68.3025 94.9741 102.1249 51.8545 43.2098
temp: 298.150 k
press: 1.00000 atm
elementType: 8 8 6 6 6 6 6 6 6 6 6 6 6 6 6 1 1 1 1 1 1 1 1 1 1 1 1 1 1 1 1 1 1 1 1 1 1
symmnumber: 1
zpe: 841104.2 jmol-1
zpe.correction: 0.320360 hartree
zpe.thermalcorrener: 0.338569 hartree
zpe.thermalcorrenthalpy: 0.339514 hartree
zpe.thermalcorrgfe: 0.271501 hartree
zpe.sumelectzpe: -657.772215 hartree
zpe.sumelectthermal: -657.754005 hartree
zpe.sumelectthermalent: -657.753061 hartree
zpe.sumelectthermalfe: -657.821073 hartree
dipole: -1.5561 2.3871 0.2398
dipole: 2.8596
quadrupole: -73.5616 -102.0699 -92.2470
quadrupole: 10.1607 0.6744 -0.6104
quadrupole: 15.7312 -12.7771 -2.9542 10.1607 0.6744 -0.6104
hfenergy: -658.0925744 hartree
pointgroup: C01 [X(C13H22O2)]
dipole: 0.5906398 0.9557797 -0.0578376 debye
polarizability: 205.3372589|-4.2215551|141.6264969|0.3108872|0.287199|112.1360404 unknown
InChI: InChI=1S/C13H22O2/c1-4-5-6-7-8-9-13(14)15-11-10-12(2)3/h12H,4-7,10-11H2,1-3H3
charge 0 multiplicity 1
37 atoms
O  -1.119873 -0.426472 -0.019664
O  -1.272512 -2.757798 0.116067
C  -4.51569 1.391238 -0.094001
C  -2.983592 1.116272 -0.08131
C  3.901061 0.82475 0.338875
C  -5.209117 0.81765 -1.354997
C  -5.215151 0.89978 1.197974
C  -2.615965 -0.367914 -0.028956
C  4.226001 -0.448149 -0.471739
C  4.560448 2.092838 -0.249813
C  3.571322 -1.737321 0.105564
C  4.236004 3.366172 0.560805
C  2.101058 -1.707989 0.093654
C  -0.573972 -1.713189 0.06052
C  0.86621 -1.664508 0.072022
H  -4.624039 2.495453 -0.130006
H  -2.527888 1.621112 0.792493
H  -2.524111 1.560257 -0.98565
H  4.237115 0.690074 1.388551
H  2.802416 0.965348 0.376244
H  -6.262815 1.148798 -1.405869
H  -5.211914 -0.288638 -1.350953
H  -4.702867 1.153091 -2.279639
H  -5.213736 -0.20441 1.267496
H  -6.270289 1.229456 1.220121
H  -4.715766 1.297774 2.101262
H  -2.985533 -0.871443 0.881864
H  -2.977211 -0.931358 -0.907603
H  3.89807 -0.315669 -1.521104
H  5.323006 -0.605715 -0.49515
H  5.659854 1.949797 -0.292608
H  4.222218 2.224516 -1.297887
H  3.913287 -1.885563 1.150485
H  3.916432 -2.623043 -0.464169
H  3.144962 3.545765 0.594126
H  4.713119 4.26011 0.118857
H  4.59196 3.273827 1.60434
