program: Gaussian 09
title: 000110522
version: EM64L-G09RevD.01
frameworkgroup: C1[X(C23H21N5O4S)]
method: RPBEPBE
basis: SDD
operation: Freq
keyword: #p
keyword: freq=noraman
keyword: PBEPBE/SDD
title: #p freq=noraman PBEPBE/SDD
converged: YES YES NO NO
title: Mulliken charges:
elementType: S O O O O N N N N N C C C C C C C C C C C C C C C C C C C C C C C H H H H H H H H H H H H H H H H H H H H H
charge: 0.987865 -0.250871 -0.569603 -0.508898 -0.508574 -0.133974 -0.312790 -0.044121 0.003619 0.003922 0.449986 -0.452558 -0.448720 0.496335 -0.012673 -0.381305 -0.380305 -0.267547 0.122072 -0.380900 -0.449818 0.117089 -0.417685 -0.418063 0.447322 -0.330092 -0.375069 -0.780696 -0.084920 -0.226969 -0.209051 -0.147039 -0.147039 0.256553 0.256844 0.256029 0.256885 0.236464 0.239522 0.254242 0.248756 0.244170 0.281702 0.261508 0.283179 0.260684 0.314252 0.293898 0.233567 0.230679 0.262455 0.279512 0.281013 0.379158
chargesum: 0.00000
title: Mulliken charges with hydrogens summed into heavy atoms:
elementType: S O O O O N N N N N C C C C C C C C C C C C C C C C C C C C C C C
charge: 0.987865 -0.250871 -0.190445 -0.508898 -0.508574 -0.133974 -0.312790 -0.044121 0.003619 0.003922 0.449986 0.060838 0.064194 0.496335 -0.012673 -0.144841 -0.140783 -0.013305 0.122072 -0.132144 -0.205648 0.117089 0.125525 0.125799 0.447322 -0.015841 -0.081171 -0.053996 -0.084920 0.052544 0.071962 -0.147039 -0.147039
polarizability: 7.97774897e+02 -4.57505415e+00 3.16024174e+02 1.86053017e+00 -2.78171869e+01 1.72718234e+02
1716.lowfreq: -9.9184 -3.7648 -1.9018 -0.0003 0.0017 0.0022 3.8141 11.4024 23.2435
frequency: -7.4742 11.3850 23.2088 24.1912 26.7050 32.5808 45.0074 50.1118 54.9859 61.8514 78.5815 89.0102 102.6261 110.0844 124.9858 129.3293 147.5450 156.7717 165.6599 172.3856 182.6003 191.3063 210.4869 216.0369 260.5870 272.6318 274.3978 281.3057 291.2091 307.0515 326.5238 332.0497 341.0410 363.2330 368.8958 379.1260 388.4398 392.1806 398.5957 410.2013 418.9142 431.2067 441.3136 461.9747 472.5644 477.2722 520.2497 529.5746 552.9441 561.0421 570.0669 592.9665 617.1608 633.6311 647.8156 657.4490 695.7624 725.7057 736.3632 739.6771 750.9122 765.2397 773.0670 781.0842 805.7456 808.3090 825.1950 833.2811 849.5116 863.3934 884.6461 937.4487 945.1557 950.4988 959.3560 965.3129 966.0423 984.1091 986.5878 994.5343 995.7230 997.5559 998.8306 1000.8108 1001.0190 1011.5243 1024.8385 1043.9547 1044.5650 1050.0418 1057.7922 1082.0699 1122.7186 1124.4604 1145.6645 1162.0282 1182.1676 1202.7283 1219.3119 1228.9590 1256.9935 1279.7701 1281.4217 1282.6696 1287.0057 1296.3571 1297.5547 1335.2258 1351.3958 1354.1745 1355.0920 1374.4910 1388.8803 1399.5826 1402.8712 1416.9836 1431.5169 1449.2780 1453.5470 1455.2651 1464.4685 1473.0018 1483.8016 1487.9908 1507.3946 1511.7650 1523.4510 1548.0299 1582.7106 1589.1178 1595.3547 1628.8321 1644.5886 2201.1341 2201.4662 2979.5529 3004.5678 3005.3139 3019.1189 3022.5201 3042.5759 3056.6303 3058.4530 3063.0063 3081.3235 3086.1415 3102.8834 3131.6566 3156.7937 3162.5464 3162.8494 3165.7598 3189.7800 3196.5326 3219.0843 3479.3587
redmass: 5.2524 8.9965 8.8988 9.0084 10.0264 8.0342 7.5256 3.6551 5.3532 4.2075 4.4464 6.3338 4.1986 4.0372 5.8084 5.8464 6.6614 5.2569 2.0409 3.1309 5.3478 5.3828 6.4534 4.8612 4.6121 3.0982 1.1613 4.1603 4.2661 6.2586 7.7539 6.3368 6.3947 3.1294 4.0052 4.5370 5.0975 5.4270 5.0004 3.7105 3.0978 3.7551 3.6999 6.0849 5.5481 6.4569 3.5792 2.8056 4.3821 6.1789 6.0695 5.1737 7.1224 6.6529 6.5561 6.4061 7.1803 4.3571 3.8020 3.7803 5.8060 2.9416 1.3784 1.3759 1.2970 6.9285 1.6949 12.7916 1.2623 1.5137 5.5472 4.7854 4.3351 1.3708 1.7955 16.8131 2.2191 3.4443 1.5883 2.7707 1.5601 1.9920 3.7297 1.5320 3.1309 4.6463 1.8513 1.2597 1.4926 6.6608 2.0461 1.8847 3.2494 1.3089 2.2411 1.4099 1.1489 1.3823 1.2167 1.6285 3.3365 1.3106 1.3456 1.4139 1.5082 1.1740 1.2751 1.7100 2.5254 1.2946 1.4038 3.2190 5.9015 1.4001 2.0918 3.5871 2.1094 1.4985 1.0955 1.7330 1.6207 1.0504 2.4681 1.1234 1.2977 2.6063 2.2573 5.3065 8.2893 8.8609 5.9217 6.9704 8.1792 12.4312 12.4318 1.0376 1.0595 1.0596 1.0598 1.0607 1.0859 1.1017 1.1012 1.0989 1.1056 1.1050 1.0971 1.0892 1.0894 1.0909 1.0911 1.0940 1.0957 1.0949 1.0913 1.0660
irintensity: 0.2895 0.4356 0.1317 2.9832 2.2924 2.8017 1.5211 2.7184 2.5728 2.3742 1.3090 1.2818 1.5352 4.1197 0.2863 0.6319 0.6092 16.0842 34.3990 17.8956 6.7695 3.6116 1.0281 4.1265 3.1481 42.2539 1.1398 10.6395 13.9926 14.0957 13.2047 33.8042 6.9357 1.6937 13.3415 25.2088 8.5835 3.0804 8.3819 16.3380 2.0616 33.9649 1.3538 35.7063 26.0470 0.6791 38.4338 41.8069 17.5706 198.7509 14.7172 5.7312 0.7354 0.5106 2.7281 24.4642 85.1084 4.6625 0.9262 4.5721 0.0895 41.8992 8.6080 43.1681 1.9046 115.0261 61.7156 96.3579 3.5816 74.2686 2.0882 12.5606 2.5312 0.7315 29.6027 91.4471 50.0614 0.8638 2.7818 14.6763 13.5080 99.5876 33.7448 2.2928 3.2025 51.0574 17.0495 51.5581 5.8394 33.5196 157.6849 3.8252 268.3171 21.7938 71.7197 52.1014 23.2736 217.2527 63.7679 21.8419 83.5536 8.7480 1.1053 130.6283 6.5839 3.4972 1.3925 54.3279 403.6947 51.5976 180.8668 23.3669 2.2506 14.5186 192.0046 20.6288 64.6566 38.6091 1.5775 43.5215 19.3467 17.2438 441.5386 29.3474 21.4917 79.1125 364.3057 20.0122 317.3208 469.2309 677.5199 426.2916 91.0461 16.9567 18.0778 19.6118 0.5553 1.2577 32.2898 39.1027 1.1211 0.1336 0.0023 13.5008 9.8018 18.5650 12.6571 5.2375 19.3411 1.7970 4.9315 29.9587 10.1868 0.0386 6.0606 41.0917
temp: 298.150 k
press: 1.00000 atm
elementType: 16 8 8 8 8 7 7 7 7 7 6 6 6 6 6 6 6 6 6 6 6 6 6 6 6 6 6 6 6 6 6 6 6 1 1 1 1 1 1 1 1 1 1 1 1 1 1 1 1 1 1 1 1 1
symmnumber: 1
zpe: 1050227.9 jmol-1
zpe.correction: 0.400011 hartree
zpe.thermalcorrener: 0.431463 hartree
zpe.thermalcorrenthalpy: 0.432408 hartree
zpe.thermalcorrgfe: 0.333337 hartree
zpe.sumelectzpe: -1859.181408 hartree
zpe.sumelectthermal: -1859.149956 hartree
zpe.sumelectthermalent: -1859.149011 hartree
zpe.sumelectthermalfe: -1859.248082 hartree
dipole: 11.3189 2.1195 0.8206
dipole: 11.5448
quadrupole: -282.1191 -234.7375 -201.1431
quadrupole: -7.5225 -14.9380 -1.5337
quadrupole: -42.7859 4.5957 38.1902 -7.5225 -14.9380 -1.5337
hfenergy: -1859.581419 hartree
pointgroup: C01 [X(C23H21N5O4S1)]
dipole: 4.4774131 0.7159572 -0.2660027 debye
polarizability: 797.1148934|-16.5037265|224.2660507|8.9666369|-74.3430513|265.1363611 unknown
InChI: InChI=1S/C23H21N5O4S/c1-17-22(23(29)28(26-17)20-8-10-21(11-9-20)33(30,31)32)16-18-4-6-19(7-5-18)27(14-2-12-24)15-3-13-25/h4-11,16,30H,2-3,14-15H2,1H3
charge 0 multiplicity 1
54 atoms
S  -9.112039 -0.043044 0.006308
O  -2.298682 -1.071229 1.616527
O  -9.332523 1.505486 1.020043
O  -9.752068 0.217091 -1.457561
O  -9.601448 -1.300063 0.902341
N  6.093573 -0.252069 0.161384
N  -3.069345 0.138306 -0.311993
N  -2.473426 0.81698 -1.414803
N  8.155439 3.2105 -2.671344
N  8.652311 -3.602726 2.709035
C  4.695143 -0.283107 0.246185
C  6.78226 0.447457 -0.934972
C  6.938112 -0.91744 1.166865
C  1.796784 -0.348786 0.404313
C  -0.777056 -0.029936 -0.0714
C  3.872747 0.39515 -0.71416
C  4.023866 -0.99052 1.296459
C  0.363271 -0.459576 0.592393
C  -1.142821 0.722728 -1.278642
C  2.476842 0.356806 -0.636009
C  2.627392 -1.011331 1.365536
C  -2.090309 -0.411595 0.556553
C  6.928125 1.979816 -0.652586
C  7.109258 -2.444572 0.872187
C  -4.482347 0.092653 -0.220873
C  -5.113743 -0.58285 0.861979
C  -5.258984 0.724938 -1.231212
C  -0.299735 1.367638 -2.343972
C  -7.254959 0.021488 -0.076718
C  -6.518855 -0.614844 0.935881
C  -6.662495 0.693912 -1.159027
C  7.604825 2.675001 -1.758244
C  7.958976 -3.099843 1.878369
H  6.252775 0.293038 -1.891112
H  7.78825 0.010595 -1.058996
H  7.933653 -0.440789 1.165814
H  6.523544 -0.776703 2.180102
H  4.325916 0.961242 -1.532743
H  4.588571 -1.525246 2.064902
H  0.087623 -1.035048 1.494672
H  1.905759 0.893754 -1.392607
H  2.148551 -1.561283 2.184548
H  5.930664 2.429569 -0.494562
H  7.503053 2.133845 0.279688
H  6.120185 -2.937843 0.85205
H  7.559785 -2.582791 -0.128536
H  -4.504016 -1.067271 1.627058
H  -4.750087 1.231016 -2.053239
H  0.3563 0.633188 -2.846266
H  0.328992 2.179453 -1.933702
H  -0.96675 1.806734 -3.103441
H  -7.02756 -1.136049 1.752471
H  -7.280752 1.1647 -1.929328
H  -10.313745 1.605766 1.194485
