program: Gaussian 09
title: 000110505
version: EM64L-G09RevD.01
frameworkgroup: C1[X(C17H20N4O5S)]
method: RPBEPBE
basis: SDD
operation: Freq
keyword: #p
keyword: freq=noraman
keyword: PBEPBE/SDD
title: #p freq=noraman PBEPBE/SDD
converged: YES YES NO NO
title: Mulliken charges:
elementType: S O O O O O N N N N C C C C C C C C C C C C C C C C C H H H H H H H H H H H H H H H H H H H H
charge: 1.045923 -0.569355 -0.263138 -0.510687 -0.511927 -0.267079 -0.070546 -0.042638 -0.148424 -0.476524 -0.335123 -0.596064 0.314187 0.033895 -0.594391 -0.431802 0.214844 -0.365026 -0.344458 0.120391 0.492733 -0.346651 -0.451866 -0.214302 -0.198544 -0.256308 -0.487179 0.275501 0.258099 0.301086 0.321106 0.230988 0.260265 0.240507 0.252573 0.278401 0.260119 0.311174 0.383996 0.309874 0.214649 0.226610 0.224119 0.228304 0.232086 0.214802 0.235799
chargesum: 0.00000
title: Mulliken charges with hydrogens summed into heavy atoms:
elementType: S O O O O O N N N N C C C C C C C C C C C C C C C C C
charge: 1.045923 -0.185359 -0.263138 -0.510687 -0.511927 -0.267079 -0.070546 -0.042638 -0.148424 -0.165351 0.198477 0.026127 0.314187 0.033895 0.137370 -0.179229 0.214844 -0.086625 -0.084339 0.120391 0.492733 -0.036777 -0.237217 0.012308 0.025575 -0.028004 0.195508
polarizability: 4.73867218e+02 -6.97303319e+00 3.22511907e+02 5.86089023e+00 2.97820026e-01 1.46077361e+02
1716.lowfreq: -17.2451 -7.4237 -3.9764 -0.0017 -0.0015 -0.0013 1.5177 7.4932 17.4253
frequency: -17.1079 6.9096 17.3145 28.2582 37.7797 42.2453 50.7977 56.8557 61.1958 82.5898 93.5497 98.0111 113.6840 124.2014 141.3518 175.2832 179.7751 190.2758 205.2738 215.4329 226.9022 238.9835 248.2595 262.8266 277.1657 287.1099 295.0659 305.7720 319.8236 338.2583 344.5249 358.8863 395.2629 407.7792 422.8606 429.5629 486.7728 509.5619 510.2983 513.2543 547.6842 560.4067 592.2868 594.7001 614.4963 630.6059 640.4194 663.4541 696.3764 719.9443 743.8887 752.3651 769.4099 774.7617 801.8819 837.2911 842.1601 842.8546 852.0033 880.2968 912.2071 917.5059 928.7046 956.4272 971.9739 975.2170 984.1207 985.6606 1001.7251 1008.2551 1022.8091 1025.0593 1030.3272 1049.8551 1080.7018 1093.6491 1103.1014 1105.1701 1115.8212 1127.2479 1143.6545 1169.7718 1171.8544 1187.2739 1227.7105 1247.3017 1251.3554 1255.9768 1259.2661 1266.5523 1281.2443 1320.1652 1344.7585 1355.6310 1371.2092 1383.1112 1387.7134 1393.6614 1406.4268 1425.0456 1430.7199 1432.5763 1443.5116 1450.8976 1456.9557 1467.7217 1480.1395 1486.2094 1486.7863 1513.5141 1553.9963 1594.4153 1603.6720 1612.6301 1616.0453 2973.8539 3009.2362 3016.1563 3049.6712 3073.0980 3086.4884 3104.9615 3120.3258 3126.0500 3131.2528 3138.3088 3142.5107 3143.2163 3158.9984 3164.5767 3169.9000 3178.7858 3196.6485 3495.2192 3533.1333
redmass: 10.7298 6.4491 4.4224 5.1836 4.3948 5.2475 4.0109 2.5547 4.2542 5.7312 4.0567 2.9544 3.5890 5.2495 2.4995 3.9984 1.8274 3.7747 2.1785 2.0062 3.1935 2.4859 2.9079 4.7294 4.6460 4.2431 4.5451 4.8415 9.7870 7.0157 5.2234 7.9953 5.1719 2.9317 4.3984 5.5246 3.3834 6.0004 3.2166 4.5337 9.4762 6.0187 5.8863 5.5864 6.4636 6.1804 1.2851 4.6011 1.9738 5.3763 5.0828 3.6269 1.7374 1.2393 6.3051 7.6329 1.5381 3.3440 1.6090 4.7855 1.5971 1.4337 3.9650 5.0939 1.3494 6.9611 6.0304 1.3724 1.3085 2.0133 1.9394 2.2297 2.4057 1.9119 1.9489 1.8501 1.4403 1.6778 1.2849 1.3120 1.3882 1.7873 1.0776 1.1141 2.8777 2.7413 1.6827 1.6068 2.1288 1.7531 1.9666 1.5098 3.7168 1.5114 1.8978 5.3184 3.6529 4.1293 1.0978 2.1124 1.1539 1.5739 1.1028 1.0559 1.0794 1.0451 2.3666 1.1193 2.3643 2.2630 7.3694 8.5416 4.1968 5.7806 6.0495 1.0363 1.0300 1.0579 1.1020 1.0563 1.1045 1.0886 1.1031 1.0973 1.0866 1.0897 1.1054 1.0933 1.0879 1.0998 1.1112 1.0974 1.0951 1.0665 1.0756
irintensity: 0.1155 0.4901 1.3635 0.2294 1.1545 0.8076 0.5900 1.8640 1.2247 2.9194 1.9038 2.8398 7.2481 5.2379 3.4062 3.1699 31.1494 3.5045 6.0647 0.1401 18.2970 5.5766 35.0243 4.3419 7.3474 11.5114 54.8458 17.5118 29.6932 0.3335 1.9431 10.2976 39.3441 0.0466 8.8744 6.7524 2.9177 7.3969 39.1130 4.3601 211.1536 20.2791 5.5825 7.5833 1.2589 11.1360 26.3354 25.0293 46.5509 9.0696 25.4822 9.1540 107.4109 5.4329 4.5451 29.6001 6.7826 16.7080 33.7875 16.1757 10.6896 16.9688 73.0334 1.9767 0.3069 35.4773 0.3643 1.6571 3.3204 46.5152 91.9401 6.2745 71.9180 60.7677 13.9059 19.0438 37.6175 62.2057 2.4124 36.6536 72.4963 42.4891 0.9757 1.8846 73.2524 132.9804 25.7664 14.8735 119.5836 49.0556 4.1149 105.7366 80.1314 44.0361 139.9864 85.2870 24.6188 80.0308 10.6872 103.3867 13.4685 35.8480 18.0109 16.5117 52.9202 15.5582 22.6081 57.7184 184.7235 332.8286 32.0620 121.5581 11.4999 177.6420 12.1117 73.7289 54.3322 18.0173 25.4372 3.9077 2.0285 18.3096 33.6494 5.5356 0.2697 9.6976 25.6145 31.0216 0.9743 31.7981 0.8669 4.9772 9.2903 63.8134 7.4261
temp: 298.150 k
press: 1.00000 atm
elementType: 16 8 8 8 8 8 7 7 7 7 6 6 6 6 6 6 6 6 6 6 6 6 6 6 6 6 6 1 1 1 1 1 1 1 1 1 1 1 1 1 1 1 1 1 1 1 1
symmnumber: 1
zpe: 929165.9 jmol-1
zpe.correction: 0.353901 hartree
zpe.thermalcorrener: 0.381329 hartree
zpe.thermalcorrenthalpy: 0.382273 hartree
zpe.thermalcorrgfe: 0.291838 hartree
zpe.sumelectzpe: -1650.775607 hartree
zpe.sumelectthermal: -1650.748179 hartree
zpe.sumelectthermalent: -1650.747234 hartree
zpe.sumelectthermalfe: -1650.837670 hartree
dipole: 2.2014 -5.8514 1.4875
dipole: 6.4263
quadrupole: -189.2496 -158.1807 -168.6786
quadrupole: 10.7848 7.9490 2.9078
quadrupole: -17.2133 13.8556 3.3577 10.7848 7.9490 2.9078
hfenergy: -1651.1295077 hartree
pointgroup: C01 [X(C17H20N4O5S1)]
dipole: -0.8706615 2.3001188 -0.5862411 debye
polarizability: 466.5494501|-26.9069392|275.2761353|-41.9220161|-75.5242143|200.6309006 unknown
InChI: InChI=1S/C17H20N4O5S/c1-21(10-11-27(23,24)25)20-19-15-12-13(8-9-16(15)26-2)17(22)18-14-6-4-3-5-7-14/h3-9,12,18,23H,10-11H2,1-2H3
charge 0 multiplicity 1
47 atoms
S  -6.217867 0.829651 0.787886
O  -6.252351 1.837511 2.359554
O  -2.154057 -2.805597 1.9929
O  -6.243499 -0.752764 1.135182
O  -7.278589 1.414938 -0.285812
O  4.020704 -2.330817 0.334115
N  -2.628028 1.105784 -1.309022
N  -1.545165 0.432283 -0.797892
N  -1.862484 -0.512078 0.057376
N  3.389492 -0.137539 -0.226241
C  -4.016966 0.732252 -0.992155
C  -4.434551 1.39811 0.330334
C  1.701928 -1.693991 0.635721
C  -0.738056 -1.246873 0.554686
C  -2.329826 2.176705 -2.266202
C  0.602057 -0.954654 0.163045
C  -0.958773 -2.333211 1.468742
C  1.461961 -2.787837 1.516221
C  0.161282 -3.089595 1.922711
C  3.128214 -1.431156 0.234841
C  4.605484 0.399296 -0.733624
C  5.795463 -0.365086 -0.877974
C  4.601883 1.770618 -1.112211
C  6.952475 0.251945 -1.400886
C  5.766524 2.371101 -1.629821
C  6.952239 1.61403 -1.779521
C  -3.465625 -2.17045 1.779327
H  -4.068933 -0.367116 -0.893583
H  -4.668468 1.061515 -1.820018
H  -4.527917 2.493308 0.281375
H  -3.828147 1.070314 1.186126
H  -2.767136 3.139346 -1.941813
H  -1.236413 2.282794 -2.323189
H  -2.720848 1.932956 -3.272258
H  0.722135 -0.150146 -0.570794
H  2.316698 -3.380461 1.855568
H  -0.045024 -3.91804 2.606391
H  2.616741 0.528093 -0.158365
H  -7.142825 1.709601 2.796848
H  5.796006 -1.41348 -0.57573
H  3.685127 2.365188 -1.000332
H  7.865865 -0.343749 -1.509609
H  5.747907 3.428599 -1.916091
H  7.858403 2.079039 -2.18197
H  -3.755078 -2.195062 0.718565
H  -3.462705 -1.127853 2.136923
H  -4.16126 -2.774423 2.380074
