program: Gaussian 09
title: 000110486
version: EM64L-G09RevD.01
frameworkgroup: C1[X(C7H6N3O3)]
method: RPBEPBE
basis: SDD
operation: Freq
keyword: #p
keyword: freq=noraman
keyword: PBEPBE/SDD
title: #p freq=noraman PBEPBE/SDD
converged: NO YES NO NO
title: Mulliken charges:
elementType: O O O N N N C C C C C C C H H H H H H
charge: -0.225185 -0.142169 -0.152256 0.039541 0.038564 0.179033 0.225574 0.451982 0.314572 -0.446519 -0.242403 -0.316203 -0.514888 0.343136 0.302531 0.325669 0.264477 0.263851 0.290693
chargesum: 1.00000
title: Mulliken charges with hydrogens summed into heavy atoms:
elementType: O O O N N N C C C C C C C
charge: -0.225185 -0.142169 -0.152256 0.039541 0.038564 0.179033 0.225574 0.451982 0.314572 -0.103383 0.060128 0.009466 0.304133
polarizability: 1.70546207e+02 1.58121423e+01 1.40617031e+02 -2.72293435e-02 2.69655334e-02 4.34861963e+01
1716.lowfreq: -1.9951 -0.0008 -0.0005 -0.0004 5.2010 5.8683 56.2287 80.6207 120.4431
frequency: 56.2152 80.5968 120.4422 129.9763 159.3607 161.6003 180.9947 253.9372 292.3287 319.1174 401.0896 414.8456 423.6937 482.3914 501.9643 557.7680 606.1937 627.8182 684.7524 721.4693 734.8531 738.1625 846.3863 879.4606 937.5995 938.4417 1006.7174 1064.6300 1110.7193 1132.2191 1150.7222 1180.4367 1191.8094 1250.0225 1282.6493 1378.9862 1401.9045 1414.9227 1429.4108 1457.1093 1471.6611 1479.4886 1556.2643 1600.5947 2107.5153 3012.7347 3128.4656 3170.3349 3172.0989 3176.1591 3189.4169
redmass: 13.4016 4.6859 10.7342 4.1812 4.9520 4.4866 1.1508 5.2315 6.8783 9.8229 4.3149 6.4586 11.5663 3.5533 8.9666 7.5917 6.3615 6.3735 6.3518 5.8672 3.8424 10.4094 1.5059 6.9804 8.7549 1.4943 1.3673 1.9386 1.2440 1.9844 1.6759 1.8110 11.6236 1.5916 2.5839 4.7335 9.4393 7.6879 1.3140 1.0812 1.0486 2.4802 7.7804 6.8101 13.9209 1.0300 1.1080 1.0948 1.0913 1.1042 1.0965
irintensity: 0.0002 0.9348 1.4030 4.1348 3.5852 9.6076 0.4209 2.8728 0.1552 0.9793 0.0838 11.8063 3.4556 7.4204 1.6476 0.5048 12.6689 5.2321 16.3306 13.1829 5.7309 28.9455 43.4945 8.5779 72.2722 23.5649 0.2955 55.8220 0.1814 46.2527 5.2431 59.4555 192.9083 31.9167 122.7261 47.2568 6.1508 49.5660 36.2570 32.0214 28.1447 167.1467 66.3465 211.8531 275.0793 9.2144 8.5698 27.4078 7.4067 2.1334 8.7451
temp: 298.150 k
press: 1.00000 atm
elementType: 8 8 8 7 7 7 6 6 6 6 6 6 6 1 1 1 1 1 1
symmnumber: 1
zpe: 339550.8 jmol-1
zpe.correction: 0.129328 hartree
zpe.thermalcorrener: 0.141001 hartree
zpe.thermalcorrenthalpy: 0.141945 hartree
zpe.thermalcorrgfe: 0.091046 hartree
zpe.sumelectzpe: -658.923004 hartree
zpe.sumelectthermal: -658.911331 hartree
zpe.sumelectthermalent: -658.910387 hartree
zpe.sumelectthermalfe: -658.961285 hartree
dipole: 8.5562 -1.1569 0.0082
dipole: 8.6341
quadrupole: -59.3355 -49.2266 -70.5808
quadrupole: -5.9803 0.0421 0.0026
quadrupole: 0.3788 10.4877 -10.8665 -5.9803 0.0421 0.0026
hfenergy: -659.0523316 hartree
pointgroup: C01 [X(C7H6N3O3)]
dipole: -3.3295441 -0.5820201 -0.3382906 debye
dipolederiv: -1.5587252 -0.7743308 -0.232472 -0.2648282 -0.4070436 -0.0474332 -0.1388961 -0.0822318 -0.2763189 -0.6059367 0.1636496 0.0008276 0.0239012 -0.5174854 -0.0621704 -0.0250777 -0.0525636 -0.1844745 -0.5989018 -0.09932 -0.0467227 -0.1557513 -0.5565486 -0.0800542 -0.0569215 -0.0757895 -0.1999225 1.6646914 -0.0380025 0.0932368 0.2069514 0.9150305 0.1489501 0.1385558 0.1315547 0.222083 0.6079603 -1.0028899 -0.1557139 -0.8322117 1.2543209 0.135957 -0.1257051 0.1260337 0.2160488 -0.1749074 0.4913858 0.0703417 0.3970798 -0.4829776 -0.0802336 0.054472 -0.0757886 0.0959442 1.509986 0.6588042 0.2120034 -0.4125565 0.3679227 0.0054694 0.0142146 0.0783135 0.1959901 -0.4823194 0.1095851 -0.0178078 -0.0431676 -0.5693233 -0.121862 -0.0457806 -0.1114488 0.0541898 -0.5241639 0.637627 0.0774581 0.2143475 -0.6616162 -0.1169964 -0.0008813 -0.0883926 0.0379453 0.4572259 -0.564405 -0.0715161 -0.0963507 0.0955107 0.0137472 0.014064 -0.0172715 -0.0179429 -0.8033118 -0.1482236 -0.0731532 0.4141352 0.1132637 0.0736509 0.0318192 0.0357472 -0.1261978 0.3980246 0.2074156 0.0643946 0.1908225 0.4067638 0.0864083 0.0610703 0.0876924 0.0275925 0.5901515 0.3146267 0.0799167 0.5044027 0.5450308 0.0860081 0.1166819 0.0734855 0.2930991 0.1601898 0.0090129 -0.0006229 0.0355815 0.1511004 -0.0053654 0.0044954 -0.0075101 0.1927123 0.0689085 -0.0457409 -0.015475 -0.0330551 0.0841224 -0.0190027 -0.0128971 -0.0200053 0.1708908 0.1566031 0.0344679 0.0056961 -0.0212669 0.1582007 -0.0029806 -0.004789 0.0006879 0.1663583 0.0751598 0.0357575 -0.0794044 -0.0799712 -0.0028841 0.0326042 -0.0649465 0.0556854 -0.0031667 0.0523333 0.0105232 0.1000395 -0.0941446 0.028602 -0.0371267 0.0433763 -0.0447431 -0.0135424 0.007032 0.000057 -0.0110265 0.046082 0.0780101 -0.00957 -0.0028547 -0.0134553 0.1487118 unknown
polarizability: 171.5667127|-15.4214142|136.2458835|5.8880641|16.0236147|46.8368388 unknown
InChI: InChI=1S/C7H6N3O3/c1-13-7-3-2-5(10(11)12)4-6(7)9-8/h2-4H,1H3
charge 1 multiplicity 1
19 atoms
O  -2.693008 -0.47388 -0.329482
O  3.664335 -0.914739 0.019668
O  3.358994 1.321682 0.412548
N  2.939113 0.134002 0.164658
N  -1.630733 1.911108 0.179324
N  -2.382075 2.785709 0.290425
C  -1.34051 -0.445713 -0.231686
C  1.456363 -0.048105 0.030325
C  -0.766046 0.856339 0.045538
C  0.637121 1.068611 0.179715
C  -0.447758 -1.539904 -0.372416
C  0.935789 -1.343677 -0.242818
C  -3.406102 -1.757513 -0.621667
H  1.06937 2.052678 0.389359
H  -0.835599 -2.539594 -0.582043
H  1.637246 -2.177555 -0.349841
H  -3.220143 -2.478323 0.191743
H  -3.08192 -2.149023 -1.600018
H  -4.464937 -1.472604 -0.651633
