program: Gaussian 09
title: 000110467
version: EM64L-G09RevD.01
frameworkgroup: C1[X(C15H12N2)]
method: RPBEPBE
basis: SDD
operation: Freq
keyword: #pfreq=noraman
keyword: PBEPBE/SDD
title: #p freq=noraman PBEPBE/SDD
converged: NO YES NO NO
title: Mulliken charges:
elementType: N N C C C C C C C C C C C C C C C H H H H H H H H H H H H
charge: -0.056180 -0.676688 0.338477 0.498223 -0.202217 -0.631458 0.412857 0.255039 -0.586934 -0.352424 -0.385410 -0.385406 -0.183965 -0.381565 -0.222076 -0.222076 -0.241475 0.250977 0.243946 0.245837 0.245048 0.245049 0.226543 0.238894 0.303988 0.343881 0.225731 0.225731 0.227653
chargesum: 0.00000
title: Mulliken charges with hydrogens summed into heavy atoms:
elementType: N N C C C C C C C C C C C C C C C
charge: -0.056180 -0.028819 0.338477 0.498223 -0.202217 -0.380481 0.412857 0.255039 -0.342988 -0.106587 -0.140362 -0.140357 0.042577 -0.142671 0.003655 0.003656 -0.013821
polarizability: 2.75832243e+02 -6.49981216e+00 1.59690404e+02 -6.59817167e-03 1.40651036e-02 1.10055297e+02
1716.lowfreq: -50.7456 -6.4339 -0.0007 -0.0005 0.0005 6.3635 12.3097 55.1459 68.3511
frequency: -50.7129 55.1315 68.3508 138.6075 170.8084 234.9052 238.2011 253.2909 278.8663 343.3902 395.5665 398.3276 441.7972 444.8578 502.1145 518.3217 540.0390 569.3040 587.3608 609.5500 622.7789 647.2126 656.2142 681.5244 705.3159 727.2059 768.3601 796.7067 806.4425 851.2690 860.3246 860.5301 871.7298 904.3636 920.5748 932.8422 972.7015 986.1302 987.7097 993.1801 1006.3267 1028.7033 1035.9279 1075.4500 1083.7697 1114.8965 1163.1593 1171.1101 1185.6543 1216.3809 1225.5965 1257.5043 1308.8298 1325.7615 1344.7743 1367.7115 1392.6657 1409.7627 1427.0186 1439.7956 1446.1906 1487.5094 1503.0620 1562.9859 1579.3546 1582.3678 1596.3450 1611.7307 1629.0360 3120.4171 3123.4912 3126.9073 3130.5966 3131.0155 3139.0335 3139.6748 3147.8774 3162.6561 3163.5962 3513.3343 3689.6179
redmass: 3.9081 4.9631 4.8559 4.8693 4.3347 4.1603 5.3651 4.6638 3.6815 4.0858 1.3442 2.8301 3.8257 2.5241 6.4271 5.7034 3.9874 4.1244 5.0760 5.8199 1.5923 2.1401 6.6256 2.4065 1.7009 5.1751 1.9689 1.2966 2.8698 1.2678 1.4442 6.0595 2.0261 4.6365 1.5485 1.4629 1.3827 1.3738 6.1733 1.3079 2.5489 2.0664 2.2362 1.6030 1.9722 1.8392 1.8370 1.0531 1.1159 1.5917 2.1156 1.5854 1.3693 2.6652 3.3490 6.8600 2.0934 5.1683 2.2039 3.4023 3.1200 2.8444 4.4022 2.8026 5.4629 6.0174 1.8264 5.5988 5.5087 1.0843 1.0875 1.0876 1.0916 1.0913 1.0922 1.0925 1.0968 1.1017 1.0992 1.0470 1.1013
irintensity: 0.0056 0.3624 0.3543 1.6654 4.7084 6.0208 1.6190 0.0170 7.9600 4.9939 135.6713 0.1123 0.6065 18.6673 5.3842 2.1210 0.4758 3.9462 13.7757 1.1242 31.7184 89.8210 8.0799 6.2960 55.1474 1.4664 39.8727 15.5875 22.5344 0.1259 1.8005 10.7483 64.8122 3.3635 1.7271 1.9358 0.0057 1.3444 1.2143 0.0646 3.6056 7.7880 1.5811 7.7356 11.1371 18.0099 2.6829 0.0234 2.6798 7.4691 3.0406 11.8639 0.5803 1.2109 0.8309 0.1307 43.9274 32.1116 7.0510 47.8673 4.2993 32.0002 55.0395 9.5447 28.7145 1.3416 196.2535 45.7961 203.2645 2.2544 9.3315 0.7619 10.0976 23.1197 20.8202 5.2221 40.1788 32.2166 30.3895 87.0189 44.9680
temp: 298.150 k
press: 1.00000 atm
elementType: 7 7 6 6 6 6 6 6 6 6 6 6 6 6 6 6 6 1 1 1 1 1 1 1 1 1 1 1 1
symmnumber: 1
zpe: 601180.3 jmol-1
zpe.correction: 0.228978 hartree
zpe.thermalcorrener: 0.241235 hartree
zpe.thermalcorrenthalpy: 0.242179 hartree
zpe.thermalcorrgfe: 0.190366 hartree
zpe.sumelectzpe: -687.164656 hartree
zpe.sumelectthermal: -687.152399 hartree
zpe.sumelectthermalent: -687.151455 hartree
zpe.sumelectthermalfe: -687.203268 hartree
dipole: -0.1932 0.2262 -0.0005
dipole: 0.2975
quadrupole: -88.0100 -86.3993 -98.4311
quadrupole: -2.6725 -0.0020 0.0013
quadrupole: 2.9368 4.5475 -7.4843 -2.6725 -0.0020 0.0013
hfenergy: -687.393634 hartree
pointgroup: C01 [X(C15H12N2)]
dipole: 0.0771207 -0.0880423 -0.0002034 debye
polarizability: 275.9750041|-5.0642555|159.5476432|0.0067713|-0.0139826|110.0552974 unknown
InChI: InChI=1S/C15H12N2/c16-14-10-13(11-5-2-1-3-6-11)9-12-7-4-8-17-15(12)14/h1-10H,16H2
charge 0 multiplicity 1
29 atoms
N  -3.575183 -0.687615 -0.000159
N  -1.949554 -2.858158 -0.000136
C  0.619576 -0.109906 -0.000017
C  -1.630368 0.868952 -0.000084
C  -2.21056 -0.455419 -0.00012
C  -0.209095 1.024454 -0.000036
C  -1.3424 -1.618661 -0.000063
C  2.115353 0.042721 0.000022
C  0.054921 -1.422365 -0.000017
C  -2.550057 1.969879 -0.000105
C  2.834396 0.116333 -1.221646
C  2.834424 0.115417 1.221734
C  -3.926974 1.729697 -0.000157
C  -4.399558 0.379019 -0.000173
C  4.240785 0.26211 -1.222068
C  4.240812 0.261206 1.22223
C  4.948801 0.335037 0.000101
H  0.229112 2.02837 -0.000012
H  0.726321 -2.289106 -0.000008
H  -2.159117 2.994247 -0.000079
H  2.286117 0.061112 -2.169157
H  2.286165 0.059502 2.169214
H  -4.647053 2.55424 -0.000172
H  -5.475155 0.166599 -0.00022
H  -1.414057 -3.72018 -0.000241
H  -2.970453 -2.869756 -0.000354
H  4.781278 0.31938 -2.173948
H  4.781327 0.31778 2.174139
H  6.038897 0.448512 0.000131
