program: Gaussian 09
title: 000110460
version: EM64L-G09RevD.01
frameworkgroup: C1[X(C9H21NO3)]
method: RPBEPBE
basis: SDD
operation: Freq
keyword: #p
keyword: freq=noraman
keyword: PBEPBE/SDD
title: #p freq=noraman PBEPBE/SDD
converged: YES YES NO NO
title: Mulliken charges:
elementType: O O O N C C C C C C C C C H H H H H H H H H H H H H H H H H H H H H
charge: -0.479509 -0.479355 -0.471315 -0.273965 0.302318 0.234716 0.331524 -0.718618 -0.718871 -0.739741 -0.697758 -0.702592 -0.722916 0.189788 0.246073 0.237215 0.265096 0.198995 0.212511 0.227148 0.249592 0.205809 0.288750 0.197526 0.222526 0.214446 0.261306 0.188134 0.214344 0.240405 0.230526 0.341314 0.339878 0.364701
chargesum: 0.00000
title: Mulliken charges with hydrogens summed into heavy atoms:
elementType: O O O N C C C C C C C C C
charge: -0.138195 -0.139476 -0.106614 -0.273965 0.302318 0.234716 0.331524 -0.045542 -0.042269 -0.057193 0.011045 -0.038706 -0.037642
polarizability: 1.23584294e+02 3.89709366e-01 1.24682784e+02 3.19820353e-01 4.32722079e-01 1.08310698e+02
1716.lowfreq: -15.5804 0.0007 0.0008 0.0008 1.2158 11.8005 73.8015 94.3440 119.9748
frequency: 73.7563 94.2031 119.9396 160.6277 174.6954 200.4874 212.5245 223.7180 237.8397 243.6132 262.6546 265.8608 287.2617 312.1189 315.7678 326.1772 331.8165 359.1859 370.8395 391.0810 397.1504 412.4465 426.9518 454.8814 471.8088 477.8932 524.9096 538.5153 559.3950 600.2498 719.2801 757.5316 781.9526 814.1881 841.4823 886.5186 892.4234 914.6107 919.1187 931.5126 975.8579 988.0314 991.4799 999.0052 1023.2222 1087.4389 1105.0058 1115.6826 1145.3975 1171.0796 1179.7590 1191.7906 1212.9896 1235.9988 1300.6280 1308.8553 1358.2983 1371.6889 1374.0222 1374.7231 1387.5475 1400.6935 1409.2303 1444.4142 1449.0771 1451.6843 1460.6168 1467.5857 1468.1321 1475.2703 1476.0973 1482.9874 1489.4730 1500.7385 1512.5732 2977.7255 2987.2002 2987.5774 2996.5419 3003.3114 3004.6474 3071.4657 3078.3498 3082.4283 3088.7611 3094.2803 3102.6007 3108.4047 3112.8095 3128.4854 3133.2381 3137.9113 3145.4435 3248.5653 3522.2639 3568.6820
redmass: 3.2691 3.0648 2.8090 1.1950 1.1111 1.2492 1.3472 1.8254 1.9733 1.3703 1.6151 1.8898 2.3552 1.7847 2.2656 2.8898 2.8945 3.8525 1.7595 1.8251 2.1140 2.5369 2.2112 3.1558 2.9602 2.1587 2.9507 3.2638 3.0498 2.7628 4.2965 1.3753 2.7354 2.9568 3.7650 1.6238 2.6972 1.6562 1.6600 1.8319 2.0951 1.2822 1.5467 1.3085 1.7161 1.4276 1.6485 1.7954 1.9293 2.4079 2.6958 2.7710 2.7728 3.3762 1.6889 1.9967 1.2261 1.2119 1.2171 1.2228 1.2043 1.2010 1.3229 1.0548 1.0623 1.0548 1.0592 1.0545 1.0560 1.0633 1.0555 1.0559 1.0565 1.0566 1.0497 1.0409 1.0383 1.0413 1.0361 1.0361 1.0367 1.0930 1.0990 1.0921 1.0994 1.0986 1.0991 1.0998 1.0993 1.0999 1.0979 1.0984 1.0988 1.0654 1.0648 1.0657
irintensity: 1.8270 4.4047 4.1517 36.9600 49.6347 5.7347 12.2702 21.4364 0.4654 1.8974 3.0372 0.4594 0.2764 2.3061 4.7112 10.1394 6.2538 1.5552 1.1051 13.3506 15.0310 5.8704 30.6487 13.8462 16.9294 19.9976 10.6060 32.7408 24.2316 5.1322 49.6901 167.9905 83.9072 5.7873 19.7178 4.3479 7.4324 10.7008 5.4015 23.4108 32.2976 2.7181 20.6073 1.3936 2.7864 121.4671 42.0609 109.1728 3.0666 20.0174 87.2383 124.7051 71.0128 150.0627 35.6484 147.4586 35.8546 67.7947 14.6859 9.9193 14.5424 18.5399 105.4965 4.0047 3.6732 2.6697 11.1018 1.0463 4.3962 6.3329 4.2438 10.0345 3.3112 15.6734 1.8860 20.8381 43.2018 30.8022 23.5309 27.9737 14.3680 21.9687 24.9975 47.1976 17.6514 48.4841 27.4881 31.4227 10.9551 0.9905 6.0220 19.8422 14.5665 194.0216 1.0515 8.2881
temp: 298.150 k
press: 1.00000 atm
elementType: 8 8 8 7 6 6 6 6 6 6 6 6 6 1 1 1 1 1 1 1 1 1 1 1 1 1 1 1 1 1 1 1 1 1
symmnumber: 1
zpe: 773115.1 jmol-1
zpe.correction: 0.294464 hartree
zpe.thermalcorrener: 0.310914 hartree
zpe.thermalcorrenthalpy: 0.311858 hartree
zpe.thermalcorrgfe: 0.254192 hartree
zpe.sumelectzpe: -634.831971 hartree
zpe.sumelectthermal: -634.815521 hartree
zpe.sumelectthermalent: -634.814577 hartree
zpe.sumelectthermalfe: -634.872243 hartree
dipole: 4.5347 2.1780 -0.3440
dipole: 5.0424
quadrupole: -82.9434 -82.9996 -79.5818
quadrupole: -1.9960 2.7322 -0.9175
quadrupole: -1.1018 -1.1580 2.2598 -1.9960 2.7322 -0.9175
hfenergy: -635.126435 hartree
pointgroup: C01 [X(C9H21N1O3)]
dipole: -1.947701 0.2660966 0.2668337 debye
polarizability: 123.9029574|-0.6112096|124.3001348|-0.4849319|1.0508359|108.3746827 unknown
InChI: InChI=1S/C9H21NO3/c1-7(2,11)10(8(3,4)12)9(5,6)13/h11-13H,1-6H3
charge 0 multiplicity 1
34 atoms
O  -1.374878 -1.99125 0.122365
O  1.382288 1.730312 1.06743
O  2.375895 -0.231954 -0.279766
N  -0.059361 -0.005433 0.198219
C  -1.469638 -0.505169 0.029476
C  0.237817 1.450959 0.094291
C  1.127278 -0.981757 -0.116831
C  -2.429366 -0.104174 1.186321
C  -2.089237 -0.173141 -1.359423
C  -0.880787 2.411158 0.55914
C  0.767486 1.941588 -1.277947
C  1.314258 -1.93133 1.089326
C  1.006976 -1.733484 -1.4607
H  -3.327954 -0.750803 1.14162
H  -1.927417 -0.278665 2.152226
H  -2.78561 0.93374 1.137418
H  -1.482589 -0.632694 -2.156015
H  -3.123079 -0.565627 -1.428691
H  -2.139025 0.913646 -1.54071
H  -1.194174 2.206435 1.596146
H  -0.447422 3.42464 0.531269
H  -1.767791 2.405854 -0.095382
H  1.6010 1.314678 -1.623114
H  -0.050196 1.903801 -2.019463
H  1.113351 2.986472 -1.190709
H  2.189879 -2.576766 0.895772
H  0.421619 -2.54928 1.258951
H  1.515943 -1.335283 1.998575
H  0.88858 -1.013063 -2.288666
H  0.170423 -2.44436 -1.452927
H  1.954418 -2.276126 -1.623464
H  -2.287347 -2.344923 -0.030226
H  1.051613 1.451468 1.962644
H  2.398443 0.497631 0.415145
