program: Gaussian 09
title: 000110429
version: EM64L-G09RevD.01
frameworkgroup: C1[X(C13H16NO)]
method: RPBEPBE
basis: SDD
operation: Freq
keyword: #p
keyword: freq=noraman
keyword: PBEPBE/SDD
title: #p freq=noraman PBEPBE/SDD
converged: NO YES NO NO
title: Mulliken charges:
elementType: O N C C C C C C C C C C C C C H H H H H H H H H H H H H H H H
charge: -0.237095 -0.152894 0.198006 0.424633 0.328505 -0.248964 -0.304577 -0.528351 -0.296428 0.348424 -0.663139 -0.346310 -0.794079 -0.258674 -0.669091 0.281223 0.269315 0.284558 0.265914 0.277680 0.287501 0.277826 0.279062 0.269787 0.272632 0.269827 0.226004 0.226254 0.228596 0.242019 0.241836
chargesum: 1.00000
title: Mulliken charges with hydrogens summed into heavy atoms:
elementType: O N C C C C C C C C C C C C C
charge: -0.237095 -0.152894 0.198006 0.424633 0.328505 0.032258 -0.035262 -0.243793 -0.030514 0.348424 0.179868 -0.067248 0.018167 0.193583 0.043361
polarizability: 2.66238101e+02 -1.18489916e+01 1.50353008e+02 1.41613954e-01 -3.03623897e-02 7.53561807e+01
1716.lowfreq: -9.4613 -1.6832 -0.0010 -0.0007 -0.0005 12.0578 42.7468 86.9036 102.9359
frequency: 42.6821 86.7479 102.9351 113.0691 113.7136 180.6597 191.9082 227.4529 246.7639 255.6973 272.5382 283.0778 356.9941 370.0404 394.4929 417.3982 469.1274 503.0883 503.8265 525.3350 566.0688 569.9998 652.0198 652.2382 720.4965 754.8424 761.0891 813.5124 830.1905 836.0499 847.6096 873.8378 898.9709 958.0491 960.9539 996.5433 1006.1160 1017.5512 1044.6859 1070.2111 1117.1324 1119.1236 1126.4059 1128.8567 1173.7536 1184.9281 1203.5904 1247.2793 1262.9502 1286.0257 1290.0077 1331.4048 1358.5212 1381.6387 1389.6724 1407.2363 1410.5579 1436.7483 1442.3633 1462.2699 1464.8536 1467.9461 1470.3825 1482.8082 1488.9333 1500.8620 1501.2950 1518.6825 1575.1106 1593.3629 1629.3672 2976.7116 2992.4873 3005.9710 3025.2508 3044.7218 3070.9582 3103.5349 3114.4922 3117.6764 3121.4346 3160.8162 3169.4128 3169.8294 3182.6222 3192.4623 3194.9278
redmass: 3.5352 2.0981 3.9485 3.4698 1.8280 1.2484 3.2536 1.4859 1.2203 3.5209 1.8425 4.6898 3.8843 3.2793 2.8684 3.2020 4.8698 3.7057 3.0926 5.4862 5.5425 3.4815 3.4602 3.9614 6.1263 3.3335 4.6356 1.3180 1.2551 1.3074 4.0757 3.3175 1.5798 1.3414 2.8810 1.3791 1.6970 2.2695 1.5551 2.9608 2.2435 1.3554 1.6049 1.4153 1.4873 1.6198 1.6655 2.1633 1.1494 2.3541 2.1184 2.7037 1.4615 2.8828 2.4795 1.2503 1.2957 1.8015 2.3314 1.0385 1.4554 1.0424 1.0962 1.1118 1.6728 1.1781 1.0518 3.1175 5.8141 6.2703 6.4271 1.0553 1.0403 1.0368 1.0381 1.1091 1.0980 1.0989 1.1033 1.1022 1.0969 1.0921 1.0928 1.0895 1.0972 1.0954 1.0968
irintensity: 1.3481 0.8340 0.9750 0.8275 2.1013 0.5933 0.1021 8.1760 0.5878 0.3550 4.1822 1.6988 0.1049 0.1509 1.1756 2.7241 2.0137 3.1047 7.0051 5.4727 10.6130 0.0140 5.4943 6.3238 2.0090 1.3435 2.2163 44.5045 7.5746 8.5036 23.8069 7.0641 43.5714 0.4746 22.4645 2.4089 3.7198 105.9594 9.2365 20.9728 3.9778 0.3465 3.5564 6.5132 113.3628 26.1129 35.8588 2.9935 0.2938 339.0502 69.5447 2.1371 1.8422 15.3845 32.0420 17.7643 21.9299 9.9497 24.5717 16.0916 46.6657 43.0040 26.9032 13.4228 8.1175 0.6341 1.3572 149.8034 85.6933 62.2092 118.0730 29.4179 0.6274 10.5919 4.7331 21.8249 2.3795 15.8613 2.5311 24.0015 4.9138 0.1839 1.0709 1.4255 3.1919 0.8604 0.1911
temp: 298.150 k
press: 1.00000 atm
elementType: 8 7 6 6 6 6 6 6 6 6 6 6 6 6 6 1 1 1 1 1 1 1 1 1 1 1 1 1 1 1 1
symmnumber: 1
zpe: 685376.3 jmol-1
zpe.correction: 0.261046 hartree
zpe.thermalcorrener: 0.275256 hartree
zpe.thermalcorrenthalpy: 0.276200 hartree
zpe.thermalcorrgfe: 0.220411 hartree
zpe.sumelectzpe: -633.643666 hartree
zpe.sumelectthermal: -633.629456 hartree
zpe.sumelectthermalent: -633.628512 hartree
zpe.sumelectthermalfe: -633.684301 hartree
dipole: 5.1742 2.3856 0.0124
dipole: 5.6977
quadrupole: -22.8406 -65.4639 -89.7475
quadrupole: -3.5114 0.0091 -0.0105
quadrupole: 36.5101 -6.1132 -30.3968 -3.5114 0.0091 -0.0105
hfenergy: -633.9047121 hartree
pointgroup: C01 [X(C13H16N1O1)]
dipole: -2.0160352 -0.9783562 -0.057616 debye
polarizability: 266.5268679|-9.5762214|149.9279649|5.0227309|0.3208485|75.492457 unknown
InChI: InChI=1S/C13H16NO/c1-4-15-12-7-8-13-11(9-12)6-5-10(2)14(13)3/h5-9H,4H2,1-3H3
charge 1 multiplicity 1
31 atoms
O  3.262762 0.539219 0.19014
N  -2.230854 -0.764399 0.035746
C  -0.844811 -0.487397 0.073014
C  -0.399084 0.889923 0.094736
C  -3.175322 0.235945 0.019069
C  -1.390301 1.921722 0.0768
C  0.130086 -1.523221 0.089756
C  0.988113 1.185177 0.133235
C  -2.742569 1.593376 0.039948
C  1.942479 0.151454 0.15118
C  -2.641941 -2.198714 0.015234
C  1.493705 -1.212449 0.127855
C  -4.648797 -0.085962 -0.020354
C  4.340098 -0.501237 0.219225
C  5.665355 0.246657 0.27006
H  -1.07633 2.970379 0.092489
H  -0.156106 -2.576389 0.073255
H  1.33142 2.22386 0.149829
H  -3.506606 2.372902 0.026144
H  -2.270624 -2.705671 0.920496
H  -3.732862 -2.283683 -0.008992
H  -2.231422 -2.691375 -0.881041
H  2.217275 -2.031943 0.139277
H  -4.97578 -0.665959 0.862273
H  -5.227201 0.849629 -0.02951
H  -4.930737 -0.655672 -0.924898
H  4.192976 -1.134485 1.115955
H  4.255281 -1.121415 -0.694418
H  6.498621 -0.478157 0.288469
H  5.78868 0.89255 -0.614922
H  5.731697 0.873132 1.17485
