program: Gaussian 09
title: 000000689
version: EM64L-G09RevD.01
frameworkgroup: C1[X(C9H15N2O14P3)]
method: RPBEPBE
basis: SDD
operation: Freq
keyword: #p
keyword: freq=noraman
keyword: PBEPBE/SDD
title: #p freq=noraman PBEPBE/SDD
converged: YES YES NO NO
title: Mulliken charges:
elementType: P P P O O O O O O O O O O O O O O N N C C C C C C C C C H H H H H H H H H H H H H H H
charge: 1.390551 1.474634 1.437196 -0.238231 -0.455525 -0.495830 -0.374285 -0.719837 -0.661628 -0.588431 -0.222862 -0.748795 -0.632488 -0.635756 -0.728501 -0.664978 -0.547567 -0.171641 -0.399533 -0.140032 -0.073998 -0.514651 -0.031995 -0.299409 0.325233 -0.026291 -0.308363 0.165732 0.239067 0.274241 0.284734 0.279088 0.282049 0.243887 0.256570 0.354568 0.316195 0.375459 0.262035 0.435291 0.429390 0.444375 0.410331
chargesum: 0.00000
title: Mulliken charges with hydrogens summed into heavy atoms:
elementType: P P P O O O O O O O O O O O O O O N N C C C C C C C C C
charge: 1.390551 1.474634 1.437196 -0.238231 -0.100957 -0.495830 -0.374285 -0.719837 -0.226337 -0.588431 -0.222862 -0.748795 -0.203098 -0.635756 -0.284126 -0.254647 -0.547567 -0.171641 -0.024074 0.099035 0.200243 0.049171 0.250055 0.201047 0.325233 0.289905 -0.046328 0.165732
polarizability: 2.65774577e+02 -1.09889352e+00 2.41217581e+02 2.06850385e+01 -1.12581254e+01 1.85444990e+02
1716.lowfreq: -5.3434 -2.2440 -0.0019 -0.0013 0.0010 5.9358 15.6910 19.2235 27.0296
frequency: 15.4410 18.8118 26.9510 35.0814 40.8305 48.6498 56.4546 66.2125 80.3927 84.6108 96.0273 125.8304 139.6559 155.9892 159.0416 168.9763 179.2627 182.9452 189.9911 195.7905 217.2728 225.5027 231.0197 243.3951 263.4190 279.2205 299.2838 310.9252 312.2206 323.3941 334.2337 340.1789 349.8715 362.2516 365.7592 375.1154 393.7560 404.6910 411.1499 420.1837 438.9830 443.3522 467.0509 498.5041 521.8635 528.6054 560.3868 576.5877 600.9642 654.4411 674.8170 679.8296 685.7500 690.5581 703.8497 709.9724 730.3559 747.7866 750.7544 757.6225 764.1503 787.6473 820.8633 834.1817 841.3463 856.2820 859.5078 923.0062 940.6827 955.6715 958.6134 967.9512 971.6867 1006.0317 1021.6835 1024.7295 1038.6476 1046.1473 1054.1192 1062.7057 1085.2635 1101.0479 1102.8226 1103.9733 1142.4925 1162.4422 1185.7529 1192.7504 1216.6194 1235.3899 1235.5361 1255.7715 1271.0538 1283.9179 1291.5885 1306.1454 1334.4646 1351.8027 1363.3480 1383.0739 1385.6595 1404.0886 1440.2991 1453.9928 1464.0094 1598.8242 1622.6561 1678.4106 2285.4068 3006.2791 3014.5232 3050.5209 3057.2491 3087.5642 3109.9664 3120.2810 3162.1407 3203.7796 3214.7891 3453.7601 3515.0675 3568.5041 3590.7650
redmass: 9.1443 8.7892 7.6007 6.4907 7.7709 10.7854 8.9353 8.6018 8.1696 8.4561 8.5898 5.8129 8.6560 8.1089 6.2195 7.3508 5.9315 7.7836 8.2472 7.1805 9.7503 5.7775 3.1528 5.1465 8.0081 4.5304 4.7783 3.2285 2.7268 1.5824 4.1651 3.9369 7.5006 6.4041 7.2672 4.2766 6.5674 3.2817 6.3386 6.2324 2.2124 3.6584 4.0067 4.6095 6.1916 6.6751 7.6432 11.1657 6.0802 3.2279 2.0330 4.2563 4.6129 4.0470 12.7423 2.3414 3.8916 9.1886 6.4720 6.3011 7.4375 1.7220 1.8287 3.8672 10.1880 3.2500 6.2875 3.1625 3.9476 2.9733 3.8694 1.5079 2.3925 8.4606 2.2966 1.4075 2.6005 2.9039 2.4503 1.3914 2.9491 4.6764 2.9943 1.6608 2.0506 1.1623 1.1985 1.8587 2.0669 1.1432 1.3337 1.2685 1.4899 1.6621 1.2622 1.3812 1.3193 1.8908 1.4037 1.4467 1.8931 1.7492 1.7028 1.0795 1.1050 4.2601 7.2300 6.6894 1.1139 1.0781 1.0647 1.0638 1.0884 1.1071 1.0898 1.1015 1.0951 1.0665 1.0966 1.0663 1.0774 1.0664 1.0662
irintensity: 1.1483 3.3631 1.8503 1.1983 2.8542 0.8060 2.7919 4.6785 1.0760 0.1491 1.6372 1.1014 9.2364 20.5434 2.0038 2.6774 4.2592 2.6086 6.0734 1.1282 12.4742 9.8108 11.1801 26.6644 12.3565 32.0928 16.5478 47.3146 2.4003 174.5637 96.6690 40.4364 51.5381 10.4454 116.1344 8.8615 124.5112 39.6298 43.2718 37.2170 68.6279 70.5986 28.5035 8.1110 14.4959 29.5173 154.0892 65.6391 4.5615 187.6067 364.1848 13.2538 7.2902 43.6736 135.6706 5.5112 4.6322 82.9769 44.9995 3.6723 192.5365 42.7822 87.1783 41.7341 446.5436 17.8099 102.5707 86.2207 170.9292 6.7492 64.1970 25.9737 67.1049 254.7132 113.6686 55.7600 8.1453 186.1895 202.2659 202.0761 61.3733 249.7994 75.8627 83.6306 25.1812 33.1311 121.4694 71.0096 68.7206 1.7762 45.4040 32.0484 475.5297 117.4420 111.3473 25.0157 3.0872 28.6050 1.5945 15.0444 51.1882 12.3889 137.5730 4.6318 23.2546 705.7603 225.4347 761.5834 3813.5687 17.6165 38.7007 6.1842 6.8708 19.3862 6.8617 1.5350 42.1361 246.9381 1.0563 115.5719 76.8436 14.9364 80.9860
temp: 298.150 k
press: 1.00000 atm
elementType: 15 15 15 8 8 8 8 8 8 8 8 8 8 8 8 8 8 7 7 6 6 6 6 6 6 6 6 6 1 1 1 1 1 1 1 1 1 1 1 1 1 1 1
symmnumber: 1
zpe: 740376.4 jmol-1
zpe.correction: 0.281994 hartree
zpe.thermalcorrener: 0.311996 hartree
zpe.thermalcorrenthalpy: 0.312940 hartree
zpe.thermalcorrgfe: 0.218819 hartree
zpe.sumelectzpe: -2536.128376 hartree
zpe.sumelectthermal: -2536.098375 hartree
zpe.sumelectthermalent: -2536.097431 hartree
zpe.sumelectthermalfe: -2536.191552 hartree
dipole: -3.2404 -6.8736 6.0302
dipole: 9.7010
quadrupole: -206.5656 -193.2775 -187.7149
quadrupole: 15.1076 -3.6468 -15.4634
quadrupole: -10.7130 2.5752 8.1378 15.1076 -3.6468 -15.4634
hfenergy: -2536.4103709 hartree
pointgroup: C01[X(C9H15N2O14P3)]
dipole: 1.2664087 2.56844 2.5231508 debye
polarizability: 265.4184616|0.5853664|239.6409947|-21.5236707|14.3379131|187.3776924 unknown
InChI: InChI=1S/C9H15N2O14P3/c12-5-3-8(11-2-1-7(13)10-9(11)14)23-6(5)4-22-27(18,19)25-28(20,21)24-26(15,16)17/h1-2,5-6,8,10,12,15-16,18,20H,3-4H2
charge 0 multiplicity 1
43 atoms
P  -2.805952 1.998916 -0.829202
P  -3.249363 -0.924709 -0.935903
P  -1.904399 -2.956583 1.079864
O  0.911094 1.682555 -0.166142
O  2.722062 2.687611 2.060073
O  -1.624974 3.044435 -0.219582
O  1.418283 -2.298751 -0.433258
O  -2.11455 0.373393 -0.55824
O  -4.019604 2.069007 0.36787
O  -3.205036 2.173654 -2.351196
O  5.68966 -1.624448 -2.118544
O  -2.438521 -2.324644 -0.51384
O  -3.227392 -1.045539 -2.627248
O  -4.644397 -0.590741 -0.231586
O  -0.396784 -2.309132 1.22445
O  -2.743494 -1.926574 2.17046
O  -2.194991 -4.503465 1.16593
N  2.405132 -0.169756 -0.091693
N  3.53131 -1.878486 -1.255133
C  1.309498 2.273185 2.122391
C  0.544786 2.697361 0.84036
C  1.293601 0.732265 2.038964
C  1.173538 0.405237 0.522244
C  -0.971927 2.74813 1.082087
C  2.392176 -1.478905 -0.582222
C  3.54197 0.641498 -0.230038
C  4.670934 0.21818 -0.880393
C  4.733877 -1.113244 -1.479292
H  0.836932 2.653007 3.049024
H  0.884834 3.663694 0.429544
H  0.426378 0.310365 2.572365
H  2.208024 0.316968 2.489409
H  0.349342 -0.290721 0.314891
H  -1.230567 3.585675 1.753832
H  -1.357305 1.802896 1.506117
H  2.79431 3.668159 2.179377
H  3.452649 1.625269 0.239333
H  3.522067 -2.836994 -1.621763
H  5.544843 0.863385 -0.972162
H  -4.598216 1.235821 0.352618
H  -3.369939 -0.16535 -3.081784
H  0.36518 -2.376716 0.472945
H  -3.642171 -2.253706 2.433675
