program: Gaussian 09
title: 000110368
version: EM64L-G09RevD.01
frameworkgroup: C1[X(C13H19NO2)]
method: RPBEPBE
basis: SDD
operation: Freq
keyword: #p
keyword: freq=noraman
keyword: PBEPBE/SDD
title: #p freq=noraman PBEPBE/SDD
converged: YES YES NO NO
title: Mulliken charges:
elementType: O O N C C C C C C C C C C C C C H H H H H H H H H H H H H H H H H H H
charge: -0.283284 -0.259904 -0.151528 -0.075289 -0.251923 -0.690958 -0.698429 0.343625 0.097937 0.160634 -0.350698 -0.350146 -0.672236 -0.643849 -0.234906 -0.264617 0.199956 0.222628 0.223747 0.208367 0.201175 0.246409 0.220550 0.213981 0.210224 0.235096 0.267268 0.238017 0.246204 0.221945 0.220049 0.250451 0.244605 0.223250 0.231650
chargesum: 0.00000
title: Mulliken charges with hydrogens summed into heavy atoms:
elementType: O O N C C C C C C C C C C C C C
charge: -0.283284 -0.259904 -0.151528 0.124666 0.194452 -0.035008 -0.053673 0.343625 0.097937 0.160634 -0.115602 -0.082879 0.033930 0.071256 -0.011656 -0.032968
polarizability: 1.97365459e+02 7.85288082e+00 1.73226602e+02 -2.40689223e+01 -1.36281879e-01 1.10548888e+02
1716.lowfreq: -13.3129 -8.9951 -3.8792 0.0001 0.0004 0.0005 23.6058 37.0642 53.3046
frequency: 23.1072 36.9968 53.2847 65.1208 98.9978 104.2650 132.6675 162.5702 195.5239 198.7964 211.7316 233.4424 235.0336 241.2876 256.7472 298.9063 301.1144 353.6664 373.6702 390.5288 417.5072 437.9824 474.4556 520.1283 547.9418 559.7572 636.1294 684.7352 729.5892 754.9900 763.3449 794.4822 843.1752 850.3624 887.5052 910.9658 921.8403 953.1093 959.6851 962.0749 968.6675 981.5245 1027.5714 1057.9705 1063.5921 1094.1347 1101.5848 1120.9993 1135.1639 1148.9520 1165.0009 1176.1972 1188.5812 1215.0996 1225.7097 1235.2580 1285.6929 1293.8207 1335.6926 1353.3428 1364.0688 1375.3014 1386.9551 1395.7071 1430.2200 1432.6004 1450.2712 1462.2576 1466.2183 1468.5857 1474.6809 1476.5515 1481.3321 1482.9249 1487.3879 1489.8439 1516.9736 1563.1534 1586.3357 1615.4442 2924.4224 2958.1865 2971.3426 2974.9725 2976.4413 2990.8770 3033.3603 3038.3878 3054.5648 3062.7670 3071.0910 3077.6138 3087.1877 3091.5647 3092.4946 3127.9175 3146.4928 3161.8284 3172.3192
redmass: 2.8372 3.4109 3.5094 5.9357 2.9351 3.2703 2.8262 3.2299 1.3438 1.1590 1.5021 1.1789 2.2277 2.8389 2.0577 3.9642 4.0178 3.1204 3.6625 2.5652 2.0820 3.2955 3.7045 3.5031 3.6829 5.0168 6.1830 4.3795 5.9891 3.3244 1.5371 4.8385 3.1970 1.5074 1.7989 1.5831 1.4601 3.0397 1.4337 1.6697 1.8910 1.3353 6.1832 2.0643 1.6066 1.2587 2.0505 1.3952 1.9932 1.7307 1.7677 1.0888 1.7272 2.1104 1.2875 3.4850 1.7767 1.3745 1.4544 2.0026 2.0283 1.2187 4.3255 1.2494 1.3840 1.4064 1.5140 1.0684 1.0568 1.0459 1.1151 1.1307 1.0498 1.0463 1.1342 1.0600 2.0793 7.0230 10.3232 6.2789 1.0488 1.0367 1.0361 1.0632 1.0556 1.0571 1.0980 1.0850 1.1065 1.0995 1.1000 1.0991 1.1007 1.0988 1.0992 1.0863 1.0890 1.0932 1.0997
irintensity: 0.0513 0.3696 0.3410 1.2628 3.4424 0.6099 2.9278 2.3183 0.2777 0.4068 2.5685 0.1237 1.1407 6.3065 3.1589 8.5240 1.0689 0.9783 3.3943 0.2524 3.5985 2.2758 2.0832 3.4637 8.3909 2.8480 3.5242 25.1278 2.0230 28.5216 51.3510 1.1451 5.0542 1.0977 6.8369 0.3379 16.0718 24.2264 4.4373 6.2973 35.6758 0.8615 255.3458 27.3485 28.8131 9.9348 75.9659 16.3311 7.2525 2.6877 30.7998 1.9766 5.0566 157.5346 1.8709 65.0587 44.4677 4.7534 3.5549 18.6725 20.0119 21.8178 12.6441 15.8656 49.1271 29.6274 12.8501 0.6611 26.6725 1.8318 9.3943 7.8947 11.1363 2.2560 10.9858 17.9401 131.4650 14.6437 283.5161 168.6252 106.0621 96.4918 31.8883 6.3389 35.8880 34.1647 59.6015 17.0101 8.0965 17.4088 73.0451 50.1879 12.2730 27.1228 33.3476 8.3266 3.8630 21.0472 22.4898
temp: 298.150 k
press: 1.00000 atm
elementType: 8 8 7 6 6 6 6 6 6 6 6 6 6 6 6 6 1 1 1 1 1 1 1 1 1 1 1 1 1 1 1 1 1 1 1
symmnumber: 1
zpe: 772622.7 jmol-1
zpe.correction: 0.294276 hartree
zpe.thermalcorrener: 0.311757 hartree
zpe.thermalcorrenthalpy: 0.312701 hartree
zpe.thermalcorrgfe: 0.248204 hartree
zpe.sumelectzpe: -710.746753 hartree
zpe.sumelectthermal: -710.729273 hartree
zpe.sumelectthermalent: -710.728329 hartree
zpe.sumelectthermalfe: -710.792826 hartree
dipole: 0.5233 4.0494 0.4888
dipole: 4.1122
quadrupole: -86.3850 -93.8626 -98.8658
quadrupole: -1.3725 -2.9297 -5.4551
quadrupole: 6.6528 -0.8248 -5.8280 -1.3725 -2.9297 -5.4551
hfenergy: -711.0410297 hartree
pointgroup: C01 [X(C13H19N1O2)]
dipole: -0.2975458 -1.5833438 0.1481567 debye
polarizability: 196.7854294|5.9165494|172.4572576|26.515066|0.3838889|111.8982614 unknown
InChI: InChI=1S/C13H19NO2/c1-10(2)9-16-13(15)11-7-5-6-8-12(11)14(3)4/h5-8,10H,9H2,1-4H3
charge 0 multiplicity 1
35 atoms
O  -1.217169 0.33431 -0.108636
O  -0.413292 2.301606 -1.052336
N  0.809372 -1.781554 -0.44851
C  -3.577403 -0.15877 0.273694
C  -2.595936 0.851884 -0.337212
C  -3.369267 -0.296469 1.798806
C  -5.025269 0.271452 -0.064382
C  1.562028 -0.70129 0.025378
C  1.1770 0.678481 -0.157548
C  -0.176906 1.180612 -0.525891
C  2.812231 -0.953376 0.682413
C  2.104533 1.711367 0.163538
C  1.053091 -3.138817 0.057941
C  -0.009663 -1.709342 -1.667124
C  3.67785 0.090452 1.045893
C  3.347526 1.438027 0.75651
H  -3.382834 -1.144222 -0.198154
H  -2.750993 0.977092 -1.42577
H  -2.683925 1.848013 0.137239
H  -4.042862 -1.065477 2.219781
H  -3.587672 0.661351 2.309653
H  -2.327574 -0.578306 2.029044
H  -5.751088 -0.450026 0.352141
H  -5.192438 0.330659 -1.156341
H  -5.252404 1.263969 0.369946
H  3.130456 -1.985236 0.855365
H  1.790181 2.742621 -0.028732
H  0.157019 -3.75523 -0.130464
H  1.225291 -3.124043 1.147617
H  1.919666 -3.637225 -0.430697
H  0.250458 -2.556214 -2.333494
H  0.197392 -0.775075 -2.21386
H  -1.092699 -1.743734 -1.445657
H  4.631719 -0.150369 1.529793
H  4.032985 2.251783 1.011854
