program: Gaussian 09
title: 000110367
version: EM64L-G09RevD.01
frameworkgroup: C1[X(C14H30O3)]
method: RPBEPBE
basis: SDD
operation: Freq
keyword: #pfreq=noraman
keyword: PBEPBE/SDD
title: #p freq=noraman PBEPBE/SDD
converged: YES YES NO NO
title: Mulliken charges:
elementType: O O O C C C C C C C C C C C C C C H H H H H H H H H H H H H H H H H H H H H H H H H H H H H H
charge: -0.270388 -0.273013 -0.267267 -0.383151 -0.380246 -0.381263 -0.377609 -0.372817 -0.353158 -0.399347 -0.356708 -0.267737 -0.696534 -0.258446 -0.003974 -0.506395 -0.528031 0.192878 0.192224 0.195272 0.195672 0.192851 0.192159 0.189621 0.189674 0.189048 0.189542 0.187997 0.187614 0.210416 0.213781 0.194640 0.194702 0.187146 0.182101 0.214870 0.209716 0.209733 0.204486 0.190845 0.226050 0.227468 0.213335 0.229730 0.234703 0.207636 0.230175
chargesum: 0.00000
title: Mulliken charges with hydrogens summed into heavy atoms:
elementType: O O O C C C C C C C C C C C C C C
charge: -0.270388 -0.273013 -0.267267 0.001951 0.010698 0.003747 0.001686 0.005772 0.022453 0.024851 0.032634 0.101510 -0.062216 0.136886 0.222076 0.164138 0.144483
polarizability: 2.19062643e+02 -3.22616364e+00 1.49262313e+02 1.62938187e+00 -1.87139564e+00 1.33092435e+02
1716.lowfreq: -4.9305 -0.0011 0.0003 0.0009 5.3597 13.6127 16.6399 24.7802 31.2275
frequency: 14.2002 24.7475 30.5587 33.6817 56.1352 61.2512 64.0137 87.7638 93.2843 101.1784 106.1426 124.5033 130.8566 134.4920 147.9365 150.1367 152.2479 153.7092 182.7461 217.5372 232.0802 251.0497 274.0335 289.7482 322.0080 360.3470 406.9044 429.6713 487.0459 497.8421 548.7982 610.3107 720.4410 724.2322 735.8167 759.7128 797.3742 802.0823 847.8326 850.0838 888.4018 909.1824 925.3676 969.9819 985.2657 998.5833 1000.5550 1011.9092 1022.2460 1026.2563 1053.1007 1056.5850 1061.3161 1072.1353 1081.0959 1082.5072 1090.8047 1105.9904 1112.5459 1117.0892 1126.9420 1147.7159 1153.8699 1162.0669 1184.1084 1209.4028 1210.5016 1217.2472 1241.1114 1245.4228 1267.6528 1275.3501 1277.8503 1282.9546 1288.0837 1295.1610 1298.4823 1303.0662 1311.3854 1331.1968 1336.0267 1351.5758 1355.0331 1357.8258 1360.7007 1388.9758 1405.9380 1420.6755 1432.8925 1455.7684 1458.0025 1459.7753 1460.2434 1463.9206 1465.5025 1466.8791 1469.6658 1474.3994 1476.0450 1477.3897 1479.8667 1481.8250 1484.6452 1488.4168 1491.7410 2904.9083 2934.3275 2949.4138 2949.8293 2952.2528 2952.6889 2953.2844 2956.3494 2957.7391 2957.8693 2963.7195 2968.0039 2971.3714 2982.3547 2987.0941 2990.5417 2990.9107 2993.7414 3003.5192 3017.0882 3020.5416 3030.0586 3040.5861 3046.5947 3049.2003 3057.7205 3067.9688 3069.9682 3110.1790 3113.7081
redmass: 4.0347 3.9929 1.8090 3.9731 2.0659 2.3551 3.4239 2.7560 1.7816 2.5513 2.8168 1.8663 2.7663 2.0498 2.1417 2.1603 1.6436 1.6806 1.8949 3.2488 1.1270 3.3555 2.8559 3.9663 3.5748 3.3684 4.0367 3.2998 3.1885 3.3483 3.3540 4.2748 1.0596 1.0725 1.0939 1.1253 1.4449 1.9811 3.4375 1.4033 1.9052 1.2086 6.2239 1.1753 5.2097 7.8108 3.7817 3.2723 1.1359 3.6382 3.1838 3.0555 3.4767 3.3708 2.0980 2.2525 2.7156 1.8522 1.2954 1.4803 2.9563 1.3532 1.4505 1.5305 1.7763 1.3727 1.3647 1.2032 1.3405 1.2988 1.2268 1.0663 1.2870 1.0586 1.1210 1.1030 1.1124 1.2361 1.3333 1.1520 1.3959 1.4985 1.6579 1.5961 1.5671 1.2174 1.5058 1.1251 1.1528 1.0793 1.0554 1.0734 1.0726 1.0671 1.0733 1.0634 1.0776 1.0770 1.0557 1.0423 1.0814 1.0519 1.0870 1.0910 1.0914 1.0548 1.0542 1.0586 1.0585 1.0593 1.0600 1.1036 1.0346 1.0354 1.0573 1.0587 1.0583 1.0367 1.0962 1.0976 1.1036 1.0597 1.0997 1.1023 1.1042 1.0874 1.1049 1.1047 1.1010 1.1008 1.1044 1.1007 1.0993 1.1009 1.1007
irintensity: 0.0265 0.0430 0.0455 0.2681 0.5873 0.4848 0.1096 3.3879 2.0869 1.2669 1.3335 0.5764 1.4433 1.6198 1.0804 0.1693 0.9592 0.7139 1.6531 13.6868 0.0145 6.8082 7.0400 0.5527 7.4235 5.7189 2.0342 0.5043 0.9567 2.3835 9.5314 2.4276 16.4736 0.0048 5.6773 0.1168 26.2136 30.8741 17.8906 1.6741 5.4821 0.1426 26.4561 1.2074 3.9109 129.1346 15.1339 77.2207 1.0204 21.0905 18.9498 68.3652 89.0521 50.8117 2.8150 5.0020 8.0116 40.4703 2.3421 11.7114 1.5568 4.0750 5.4967 5.1010 0.0406 6.2474 8.1091 9.8434 0.1757 0.6496 0.1359 0.0750 0.2033 0.4731 0.1825 0.0035 0.1672 8.2462 2.1459 13.6484 1.2281 0.4757 1.7559 2.2371 4.7285 11.1586 15.3885 3.9757 7.5272 7.7924 11.1236 0.1914 0.0945 0.0637 0.1151 1.1872 0.2775 1.0094 15.3335 12.3681 2.9363 10.0132 1.5143 21.2621 16.0191 52.0304 58.0326 0.0493 0.1291 4.1315 5.4624 49.6114 114.4759 17.5255 2.2678 67.4070 188.4271 35.2588 0.1751 0.5536 30.7691 42.4654 1.1695 0.4277 2.6896 48.9017 0.1070 157.8054 25.5419 71.5485 114.2580 99.6573 55.9242 30.0928 25.6282
temp: 298.150 k
press: 1.00000 atm
elementType: 8 8 8 6 6 6 6 6 6 6 6 6 6 6 6 6 6 1 1 1 1 1 1 1 1 1 1 1 1 1 1 1 1 1 1 1 1 1 1 1 1 1 1 1 1 1 1
symmnumber: 1
zpe: 1102492.1 jmol-1
zpe.correction: 0.419917 hartree
zpe.thermalcorrener: 0.443259 hartree
zpe.thermalcorrenthalpy: 0.444203 hartree
zpe.thermalcorrgfe: 0.362847 hartree
zpe.sumelectzpe: -775.663765 hartree
zpe.sumelectthermal: -775.640423 hartree
zpe.sumelectthermalent: -775.639478 hartree
zpe.sumelectthermalfe: -775.720834 hartree
dipole: -0.1880 -0.9455 1.0481
dipole: 1.4240
quadrupole: -104.9400 -102.7790 -110.1213
quadrupole: -0.4543 7.0239 -1.6290
quadrupole: 1.0067 3.1678 -4.1745 -0.4543 7.0239 -1.6290
hfenergy: -776.0836819 hartree
pointgroup: C01 [X(C14H30O3)]
dipole: 0.0745943 -0.3827879 -0.402219 debye
polarizability: 219.0537528|3.344782|149.3580241|1.5847023|1.440332|133.0056138 unknown
InChI: InChI=1S/C14H30O3/c1-4-5-6-7-8-9-10-11-12-17-13-14(15-2)16-3/h14H,4-13H2,1-3H3
charge 0 multiplicity 1
47 atoms
O  -3.061172 -0.053399 0.343075
O  -5.63874 1.142606 -0.698515
O  -6.6945 -0.497702 0.728591
C  3.255542 -0.524542 -0.184823
C  1.933108 0.130762 0.272163
C  4.509358 0.283548 0.219061
C  0.678907 -0.675368 -0.134408
C  5.832481 -0.360669 -0.252463
C  7.085783 0.449539 0.149034
C  -0.638202 0.002052 0.307657
C  8.408964 -0.18989 -0.330349
C  -1.8766 -0.799884 -0.10131
C  9.655137 0.627834 0.073185
C  -4.30959 -0.729413 -0.008123
C  -5.452867 0.207626 0.395717
C  -6.439647 2.317746 -0.324847
C  -7.240846 -1.311633 -0.370103
H  3.325891 -1.547368 0.241508
H  3.240337 -0.648588 -1.288105
H  1.864061 1.152837 -0.155224
H  1.946493 0.255654 1.374979
H  4.530982 0.39929 1.323037
H  4.433109 1.309522 -0.198513
H  0.675046 -0.810339 -1.236473
H  0.741765 -1.693301 0.304656
H  5.809975 -0.476185 -1.356572
H  5.910506 -1.386606 0.165064
H  7.113317 0.561043 1.253403
H  7.006436 1.477139 -0.264149
H  -0.646704 0.134863 1.406886
H  -0.712138 1.01304 -0.137411
H  8.379996 -0.301954 -1.433615
H  8.488386 -1.215992 0.083663
H  -1.909779 -0.935033 -1.206621
H  -1.865163 -1.810723 0.368336
H  10.587252 0.150332 -0.281374
H  9.614217 1.648033 -0.35342
H  9.723806 0.728094 1.173026
H  -4.354593 -0.935863 -1.099113
H  -4.400767 -1.686433 0.551316
H  -5.198615 0.733008 1.336794
H  -7.445319 2.021233 0.028538
H  -5.929864 2.902065 0.467653
H  -6.523855 2.927709 -1.237464
H  -7.295292 -0.727527 -1.307759
H  -6.637535 -2.226547 -0.538485
H  -8.252865 -1.602018 -0.047904
