program: Gaussian 09
title: 000110267
version: EM64L-G09RevD.01
frameworkgroup: C1[X(C22H22O)]
method: RPBEPBE
basis: SDD
operation: Freq
keyword: #pfreq=noraman
keyword: PBEPBE/SDD
title: #p freq=noraman PBEPBE/SDD
converged: YES YES NO NO
title: Mulliken charges:
elementType: O C C C C C C C C C C C C C C C C C C C C C C H H H H H H H H H H H H H H H H H H H H H H
charge: -0.259937 0.038630 0.447601 0.431412 -0.756140 -0.755529 -0.363485 -0.436339 -0.383714 -0.421194 -0.388782 -0.367449 0.327445 -0.243201 -0.241945 -0.248732 -0.457408 0.477921 -0.389779 -0.388318 -0.227541 -0.227510 -0.231369 0.208042 0.230221 0.232965 0.235183 0.208512 0.230145 0.248223 0.241929 0.247557 0.243210 0.249448 0.245914 0.223038 0.221390 0.226231 0.209572 0.209339 0.234353 0.234548 0.227800 0.227752 0.229991
chargesum: 0.00000
title: Mulliken charges with hydrogens summed into heavy atoms:
elementType: O C C C C C C C C C C C C C C C C C C C C C C
charge: -0.259937 0.038630 0.447601 0.431412 -0.084912 -0.081689 -0.115262 -0.194410 -0.136157 -0.177984 -0.139334 -0.121535 0.327445 -0.020163 -0.020555 -0.022501 -0.038498 0.477921 -0.155426 -0.153770 0.000259 0.000243 -0.001378
polarizability: 3.35780195e+02 7.35704248e-01 2.11046328e+02 5.98239234e+00 7.75215963e+00 1.75979727e+02
1716.lowfreq: -0.0003 0.0004 0.0005 2.9368 4.0972 6.7422 12.5172 22.9790 30.5346
frequency: 5.1976 22.8153 30.1820 35.1010 50.2330 66.1498 91.7056 119.9547 129.3086 173.4675 196.7729 232.9507 249.8260 270.9129 303.3502 306.7955 316.6895 328.1130 336.4941 356.5398 396.9509 402.4157 402.5117 413.6887 448.6566 482.9034 504.7358 538.1842 551.3498 572.1209 605.4277 617.5835 618.0459 633.1947 671.1892 702.1675 705.0697 737.8554 748.6488 770.2034 777.9364 803.1536 812.8303 841.3894 847.2773 852.2084 852.4814 909.4939 921.5618 925.4048 932.0847 939.1995 946.0804 971.5888 975.7765 976.3568 978.6551 990.1298 990.8868 993.0718 997.1878 999.5103 1005.0177 1025.8050 1027.2052 1074.6668 1090.3943 1091.9629 1110.3025 1118.6779 1157.1625 1171.8174 1173.1451 1177.6431 1187.6322 1194.9972 1196.4239 1219.0987 1228.0699 1230.5350 1247.0500 1307.6848 1320.2645 1325.7649 1354.7997 1370.1449 1372.9725 1378.1000 1387.6436 1394.1030 1415.3918 1433.2352 1441.4238 1463.4812 1470.6205 1477.4238 1482.0449 1485.7621 1486.6288 1487.5638 1498.6149 1578.3355 1589.3875 1597.6716 1610.8205 1618.2433 1620.5661 2956.8428 2975.8802 2979.1652 3016.3037 3070.7129 3073.7441 3082.8854 3084.9257 3116.3423 3122.0512 3123.4581 3124.3579 3128.3942 3136.2337 3136.9670 3139.1822 3148.9343 3149.0598 3161.1104 3162.0662 3164.7822 3164.9638
redmass: 3.6993 5.2763 4.0510 3.8033 4.7121 4.9818 3.8977 4.2540 5.1162 3.7423 4.6293 2.9776 3.3704 1.2298 2.5910 1.1905 3.5835 2.7187 2.3763 4.0727 3.8114 2.8092 2.8023 2.9686 3.8280 3.5022 3.5743 4.0312 3.1182 2.8133 4.4319 6.3679 6.3427 6.9587 5.2789 1.7824 1.6211 3.6432 2.2655 2.3710 2.2432 3.9573 1.3964 1.5253 3.4447 1.2484 1.2532 1.8940 1.9221 1.6451 1.4945 1.4453 3.8494 1.3602 1.3954 1.3892 1.5681 4.5063 5.6608 1.3973 1.3506 1.8960 1.7727 2.4852 2.1746 1.7486 1.5018 1.9677 1.9312 1.6308 2.4021 1.0538 1.0540 1.5596 1.1172 1.1201 1.0881 2.0593 3.1859 2.6314 3.2595 1.2923 1.3545 1.2710 1.7689 2.8765 1.4418 3.5126 8.4538 1.1986 3.6367 2.2117 2.1902 1.0760 1.1385 1.1317 1.4399 1.0872 1.7383 1.6261 2.1849 6.9940 6.0426 6.1350 6.0345 6.2315 6.3519 1.0556 1.0348 1.0356 1.1074 1.0995 1.0995 1.0999 1.0995 1.0850 1.0851 1.0871 1.0883 1.0885 1.0921 1.0929 1.0871 1.0946 1.0964 1.0946 1.1008 1.0955 1.1017
irintensity: 0.0058 0.1903 0.0625 0.2136 0.3041 0.1456 1.2964 0.7699 0.6071 0.6958 0.8522 0.3627 0.6923 0.1693 0.0531 0.1227 0.3379 0.8779 1.0987 0.0114 0.1555 0.2211 0.0410 0.0805 0.2872 0.7222 11.8444 5.5206 17.7015 16.5401 19.2825 0.9451 0.1335 0.8574 5.3512 54.9477 57.8476 2.5308 34.7779 38.2267 33.7259 1.0522 18.2402 41.0068 23.5596 0.0517 0.5313 3.6261 76.5927 1.5620 3.3502 2.3974 80.1302 0.2274 0.0017 0.2437 2.6693 0.0548 0.7354 0.5338 0.0058 6.8176 13.7712 17.7036 5.2512 14.6818 7.1673 9.8513 3.8224 5.8915 3.7295 1.5663 0.0109 233.2035 0.5954 0.9003 1.0533 178.9262 31.9300 8.4461 31.3393 1.2520 1.4143 0.2838 11.8114 57.3627 19.1277 4.0091 0.4321 12.2082 4.4962 9.4378 9.0184 5.4291 14.6361 25.5798 4.7249 22.2552 3.4487 6.1339 163.4459 25.2255 1.1304 0.6716 8.2409 0.0217 57.6100 40.6632 25.5862 30.2888 26.9530 7.0238 70.0369 35.8973 39.2255 5.7850 5.0368 0.8201 1.7791 13.7931 16.8998 27.2504 17.5003 29.3998 48.7195 21.3410 21.5927 5.2354 22.8549
temp: 298.150 k
press: 1.00000 atm
elementType: 8 6 6 6 6 6 6 6 6 6 6 6 6 6 6 6 6 6 6 6 6 6 6 1 1 1 1 1 1 1 1 1 1 1 1 1 1 1 1 1 1 1 1 1 1
symmnumber: 1
zpe: 976717.4 jmol-1
zpe.correction: 0.372012 hartree
zpe.thermalcorrener: 0.392599 hartree
zpe.thermalcorrenthalpy: 0.393544 hartree
zpe.thermalcorrgfe: 0.318945 hartree
zpe.sumelectzpe: -925.122111 hartree
zpe.sumelectthermal: -925.101523 hartree
zpe.sumelectthermalent: -925.100579 hartree
zpe.sumelectthermalfe: -925.175177 hartree
dipole: 0.9341 -0.8833 1.0035
dipole: 1.6309
quadrupole: -120.3405 -128.8275 -132.7300
quadrupole: 0.4658 4.2103 1.9738
quadrupole: 6.9588 -1.5282 -5.4307 0.4658 4.2103 1.9738
hfenergy: -925.4941226 hartree
pointgroup: C01 [X(C22H22O1)]
dipole: -0.3695489 -0.2978886 -0.4317538 debye
polarizability: 335.6828675|-2.8716925|212.3624048|6.4169112|-3.846054|174.7609784 unknown
InChI: InChI=1S/C22H22O/c1-22(2,19-11-7-4-8-12-19)20-13-15-21(16-14-20)23-17-18-9-5-3-6-10-18/h3-16H,17H2,1-2H3
charge 0 multiplicity 1
45 atoms
O  -2.389919 -0.020732 0.256185
C  3.261105 -1.282708 -0.219562
C  1.750701 -0.941739 -0.179517
C  4.101334 -0.002189 0.027397
C  3.524162 -2.378046 0.856453
C  3.698265 -1.859702 -1.599593
C  1.229447 -0.216762 0.930541
C  0.834254 -1.360839 -1.170231
C  3.819919 1.166789 -0.731304
C  5.183515 0.044649 0.941711
C  -0.139462 0.071468 1.046799
C  -0.551307 -1.079949 -1.07428
C  -1.041781 -0.362215 0.041618
C  4.591473 2.338187 -0.585277
C  5.959805 1.218609 1.094074
C  5.6701 2.370284 0.330632
C  -3.367087 -0.453696 -0.775405
C  -4.736189 0.012842 -0.339884
C  -5.555771 -0.815434 0.466732
C  -5.21372 1.291221 -0.722062
C  -6.830158 -0.374016 0.887429
C  -6.487232 1.736781 -0.303501
C  -7.298655 0.903753 0.501907
H  4.570843 -2.73355 0.825001
H  3.309088 -2.009671 1.875383
H  2.866517 -3.244671 0.66616
H  4.788577 -2.035326 -1.598017
H  3.200117 -2.824752 -1.808489
H  3.471146 -1.159966 -2.423644
H  1.915576 0.141483 1.706982
H  1.187361 -1.915989 -2.045112
H  2.974502 1.159598 -1.429854
H  5.429863 -0.832395 1.548753
H  -0.53523 0.632146 1.899348
H  -1.220617 -1.423679 -1.868632
H  4.350387 3.226919 -1.179991
H  6.789464 1.230624 1.810675
H  6.270163 3.279621 0.448994
H  -3.328598 -1.55848 -0.865186
H  -3.082406 -0.006289 -1.749537
H  -5.190393 -1.803881 0.770663
H  -4.582544 1.93988 -1.34148
H  -7.455424 -1.022322 1.511298
H  -6.846436 2.727398 -0.60372
H  -8.287754 1.247148 0.825542
