program: Gaussian 09
title: 000000661
version: EM64L-G09RevD.01
frameworkgroup: C1[X(C19H21N7O6)]
method: RPBEPBE
basis: SDD
operation: Freq
keyword: #p
keyword: freq=noraman
keyword: PBEPBE/SDD
title: #p freq=noraman PBEPBE/SDD
converged: YES YES NO NO
title: Mulliken charges:
elementType: O O O O O O N N N N N N N C C C C C C C C C C C C C C C C C C C H H H H H H H H H H H H H H H H H H H H H
charge: -0.399095 -0.292812 -0.241642 -0.419826 -0.213917 -0.224969 -0.419455 -0.458245 -0.400074 0.025350 -0.448334 -0.039501 -0.623173 -0.134531 -0.390757 0.156292 -0.474943 -0.551175 0.351705 -0.483518 -0.122298 0.487270 0.281130 0.153436 0.114344 -0.363907 -0.463326 -0.385380 -0.328252 -0.013196 0.150590 0.179279 0.311370 0.247925 0.284325 0.246667 0.259017 0.281243 0.219110 0.308550 0.267323 0.257204 0.340315 0.300062 0.228348 0.222506 0.305705 0.273709 0.211428 0.389672 0.307024 0.353899 0.377525
chargesum: 0.00000
title: Mulliken charges with hydrogens summed into heavy atoms:
elementType: O O O O O O N N N N N N N C C C C C C C C C C C C C C C C C C C
charge: -0.009422 -0.292812 -0.241642 -0.042300 -0.213917 -0.224969 -0.110904 -0.117930 -0.100012 0.025350 -0.142628 -0.039501 0.037750 0.176839 0.141494 0.156292 0.030741 -0.050822 0.351705 0.041009 -0.122298 0.487270 0.281130 0.153436 0.114344 -0.135559 -0.240819 -0.111671 -0.116825 -0.013196 0.150590 0.179279
polarizability: 4.58175088e+02 4.13906980e+00 2.59874802e+02 -3.10717891e+01 2.81177636e+00 2.11017383e+02
1716.lowfreq: -6.4281 -2.1858 -0.0009 0.0002 0.0009 2.2079 7.9953 9.9070 15.5857
frequency: 7.6660 9.2199 15.5097 17.5891 23.4581 38.4978 42.9075 51.4416 52.2262 69.6305 82.8586 88.7437 94.9969 100.2716 125.0127 133.9838 135.4526 176.7192 189.8855 203.2239 212.5078 219.6320 225.4076 259.6780 272.2636 285.7126 296.5756 311.9796 323.7793 326.0695 341.6765 377.9051 402.0655 410.9257 424.3591 451.8880 453.0271 469.0038 494.0911 499.5270 503.9929 506.7105 518.4424 532.6463 543.5597 549.0644 555.1848 559.6686 586.0790 588.5569 591.6632 613.3530 627.2103 634.9353 636.7289 637.8512 650.3340 655.3478 684.6211 690.0471 723.5991 753.6961 759.1431 766.1608 776.3740 798.6472 810.3134 815.6588 833.8913 838.6683 874.7177 899.4485 932.9044 935.9174 940.6382 964.2343 970.3659 988.1085 995.3001 1019.0613 1023.1196 1044.4026 1052.4247 1058.7815 1062.3368 1094.0491 1104.4821 1125.8544 1144.7858 1157.6234 1172.8293 1185.3214 1186.2365 1201.0330 1220.4587 1240.2836 1240.8405 1248.2674 1264.8623 1279.2301 1280.4947 1286.2467 1292.0851 1299.6127 1314.1484 1324.7093 1335.5654 1339.8285 1353.3219 1365.6908 1373.8047 1379.5239 1420.2075 1437.2553 1440.1018 1462.8723 1465.4602 1468.2685 1474.1565 1480.2124 1508.8104 1530.4441 1553.2229 1574.2635 1586.8903 1591.9703 1596.3543 1603.2565 1629.5222 1645.2063 1651.0076 1670.8939 2930.1042 2990.1621 2997.3691 3009.6441 3034.7195 3039.8960 3072.9186 3076.6821 3101.0656 3111.0091 3134.7659 3139.7644 3161.4123 3512.6845 3517.8044 3518.7770 3519.2293 3542.3394 3545.4446 3551.6053 3692.7061
redmass: 7.3493 7.3915 7.8501 10.0945 7.4961 4.8786 7.5960 7.7770 7.7021 5.0874 5.7382 2.6739 5.7619 5.6179 5.1029 4.8999 4.6949 6.4820 5.1372 6.2797 5.0210 4.7733 1.7101 3.2078 1.4279 3.3916 2.8339 4.9815 2.6183 5.3889 5.3854 3.2915 5.7660 3.0235 4.7333 4.6681 3.8251 4.1526 3.6504 1.3169 1.8048 1.6578 2.2910 3.6665 2.2754 1.8427 3.0083 2.8194 4.0210 3.0364 1.5193 4.1102 5.9041 5.3178 1.5913 1.4706 6.0057 5.9155 3.8203 8.6347 4.6308 3.9856 10.7029 3.4812 1.9804 4.1603 1.4088 4.5846 4.1356 1.7424 4.0876 4.4822 4.2256 2.3494 1.5509 2.5011 2.0690 1.3686 2.9083 2.3341 2.7057 2.8347 3.2079 4.3055 2.1818 2.5531 2.4684 1.5146 2.6092 1.7709 4.8866 1.6000 2.3837 1.2313 1.4188 1.2853 1.4329 1.5235 1.6731 1.7753 1.5983 1.3298 1.9378 1.9024 1.4600 1.6774 1.4917 1.4699 2.4722 2.2741 3.1438 1.8032 3.6757 3.3972 1.1449 1.1568 1.2054 1.1228 1.8584 1.7746 2.7304 3.2624 5.1300 3.9151 6.6233 4.3539 2.4599 3.1289 6.3029 8.3991 3.5383 8.2335 1.0699 1.0606 1.0813 1.0602 1.0628 1.0967 1.0931 1.1020 1.1036 1.0864 1.0964 1.0871 1.0959 1.0639 1.0718 1.0774 1.0695 1.0457 1.0780 1.0766 1.1043
irintensity: 0.3605 3.1492 9.5982 0.5638 4.1856 3.7181 3.4211 0.5694 0.0503 4.4091 1.0723 1.5049 0.8380 5.0994 4.1148 7.7385 2.3386 5.1709 3.1943 11.1362 8.5508 1.1702 23.6476 3.4936 67.9650 51.9500 58.9070 9.2021 51.1134 1.3274 1.4264 5.8647 5.1465 1.7777 28.1240 4.0988 19.7540 7.7752 11.2904 212.8746 90.8079 76.3009 5.3726 63.5442 49.8436 139.9338 22.0076 101.7510 5.0279 27.9718 15.4256 7.0376 3.3466 2.7075 119.2540 125.5857 1.4568 2.4264 44.0299 18.5490 11.4683 16.4879 11.6498 17.4907 40.7453 5.9454 16.4835 16.7274 3.1885 41.4993 11.4296 17.4944 12.4661 5.0686 1.3940 22.2397 28.3555 1.7029 3.8248 13.3962 124.4208 245.8691 28.6834 29.3755 154.1544 27.2877 66.7165 12.5359 9.4157 3.4221 31.2109 13.9064 27.1602 159.6649 8.6722 6.9927 21.6163 13.2007 107.4876 16.6337 48.4343 3.2959 133.0547 9.4869 52.9767 35.0141 46.4518 8.8658 288.8924 137.3686 73.2026 91.3608 199.2715 26.0675 28.6983 8.3019 188.2543 24.0794 345.2226 199.3616 156.6571 72.9765 149.1442 162.6895 114.5793 52.6943 174.3741 423.9448 509.1291 161.8804 427.6796 211.3800 51.2944 10.7043 21.8212 28.0491 10.8769 6.7171 3.1116 8.1999 11.4063 19.6251 22.7877 13.1315 12.5415 21.3341 103.4812 13.2815 4.3824 106.7508 17.9732 50.1609 42.9621
temp: 298.150 k
press: 1.00000 atm
elementType: 8 8 8 8 8 8 7 7 7 7 7 7 7 6 6 6 6 6 6 6 6 6 6 6 6 6 6 6 6 6 6 6 1 1 1 1 1 1 1 1 1 1 1 1 1 1 1 1 1 1 1 1 1
symmnumber: 1
zpe: 1052851.0 jmol-1
zpe.correction: 0.401010 hartree
zpe.thermalcorrener: 0.431948 hartree
zpe.thermalcorrenthalpy: 0.432892 hartree
zpe.thermalcorrgfe: 0.331963 hartree
zpe.sumelectzpe: -1568.928908 hartree
zpe.sumelectthermal: -1568.897970 hartree
zpe.sumelectthermalent: -1568.897026 hartree
zpe.sumelectthermalfe: -1568.997955 hartree
dipole: -4.3889 7.8550 -2.3122
dipole: 9.2903
quadrupole: -242.8704 -159.0004 -193.3163
quadrupole: 59.6282 29.8760 -7.8075
quadrupole: -44.4747 39.3953 5.0794 59.6282 29.8760 -7.8075
hfenergy: -1569.3299178 hartree
pointgroup: C01 [X(C19H21N7O6)]
dipole: -1.6772178 -2.3140698 2.2785129 debye
polarizability: 459.2484969|10.7138433|251.6348414|24.5445717|-18.7176194|218.1839345 unknown
InChI: InChI=1S/C19H21N7O6/c20-19-25-15-14(17(30)26-19)23-11(8-22-15)7-21-10-3-1-9(2-4-10)16(29)24-12(18(31)32)5-6-13(27)28/h1-4,12,21-22,24-25,27,31H,5-8,20H2
charge 0 multiplicity 1
53 atoms
O  -8.13043 0.955113 0.154977
O  -3.833551 -0.367074 -2.172354
O  -6.36953 2.02783 1.221581
O  -5.903666 -3.349721 3.043829
O  8.033347 1.165911 -0.267506
O  -6.253901 -4.004619 0.843999
N  3.968997 -1.447909 -0.17871
N  -4.504756 0.62848 -0.192086
N  1.872455 2.137093 -0.323524
N  5.120916 1.08704 -0.542551
N  5.994511 -2.233105 0.832311
N  7.994159 -0.882401 0.878149
N  7.960213 -2.988758 1.914368
C  -5.899144 0.236096 -0.417562
C  -6.180471 -1.261749 -0.086279
C  3.906943 0.868932 -0.990493
C  3.372274 -0.559784 -1.203115
C  2.999191 2.058043 -1.268137
C  5.294344 -1.228795 0.157462
C  -5.893366 -1.609331 1.384076
C  5.917218 -0.010572 -0.1411
C  0.573235 1.681942 -0.532374
C  -2.140868 0.794536 -0.870067
C  -3.529592 0.309594 -1.132635
C  -6.779162 1.170525 0.403503
C  0.135361 1.106005 -1.766659
C  -0.379572 1.790139 0.5305
C  -1.192382 0.677206 -1.919059
C  -1.70272 1.357692 0.36145
C  7.369607 0.165239 0.116028
C  7.337338 -1.97771 1.198572
C  -6.042387 -3.090051 1.668656
H  -6.141729 0.369897 -1.490876
H  -7.231057 -1.486571 -0.339662
H  -5.543785 -1.86549 -0.754308
H  3.643267 -0.912859 -2.222415
H  2.273921 -0.590342 -1.115085
H  3.61877 2.967023 -1.178378
H  2.603201 2.028296 -2.299459
H  3.367493 -2.031948 0.403744
H  -4.859951 -1.316396 1.656162
H  -6.557099 -1.063954 2.08255
H  -4.338059 1.317423 0.5463
H  2.100364 2.488071 0.607701
H  0.824602 1.004057 -2.610889
H  -0.066006 2.220681 1.489787
H  5.619898 -3.184352 0.853385
H  -1.530977 0.233897 -2.861667
H  -2.383137 1.446359 1.217169
H  -8.677853 1.579585 0.704018
H  7.444184 -3.704332 2.420821
H  8.938772 -2.826449 2.143519
H  -5.99813 -4.328738 3.20013
