program: Gaussian 09
title: 000110201
version: EM64L-G09RevD.01
frameworkgroup: C1[X(C16H27N)]
method: RPBEPBE
basis: SDD
operation: Freq
keyword: #pfreq=noraman
keyword: PBEPBE/SDD
title: #p freq=noraman PBEPBE/SDD
converged: YES YES NO NO
title: Mulliken charges:
elementType: N C C C C C C C C C C C C C C C C H H H H H H H H H H H H H H H H H H H H H H H H H H H
charge: -0.698636 -0.392386 -0.383035 -0.375341 -0.387853 -0.021303 -0.367585 -0.384205 -0.575320 -0.716170 -0.716363 0.522985 -0.409755 -0.406343 -0.415442 -0.416378 0.478426 0.202662 0.188283 0.191494 0.192722 0.188404 0.187651 0.194438 0.193687 0.191495 0.190998 0.191799 0.207778 0.206581 0.200744 0.201962 0.209357 0.222659 0.202689 0.205517 0.210869 0.212297 0.225150 0.224928 0.209837 0.209876 0.300417 0.300411
chargesum: 0.00000
title: Mulliken charges with hydrogens summed into heavy atoms:
elementType: N C C C C C C C C C C C C C C C C
charge: -0.097807 -0.001441 0.001181 0.000714 0.000272 0.170192 0.015211 0.030154 -0.172613 -0.081466 -0.087680 0.522985 -0.184606 -0.181415 -0.205605 -0.206502 0.478426
polarizability: 2.48739620e+02 -2.57606883e+01 1.47419733e+02 1.19199562e+01 9.53185654e+00 1.55245052e+02
1716.lowfreq: -19.0138 -9.5124 -3.9844 -0.0012 -0.0009 0.0008 4.0275 14.7353 24.1597
frequency: -12.7967 5.4929 24.1428 33.5258 54.7014 64.4400 83.3113 105.1210 131.2571 136.5855 141.7383 148.4501 200.4428 216.5823 237.3519 265.0252 291.3664 306.5352 330.0819 356.7638 361.6988 390.2222 390.6406 409.2638 412.5297 466.8101 471.3181 506.8414 550.2475 640.4986 719.3946 725.2572 728.7714 751.9163 770.1460 800.1005 815.6329 818.1762 821.9805 834.3767 878.8705 913.8777 932.9154 934.6341 949.9104 951.2767 965.4439 993.7716 1000.7038 1003.7897 1010.6399 1027.6740 1048.7674 1064.2215 1075.4706 1078.7817 1081.1054 1134.2572 1136.2024 1176.1956 1180.5400 1186.7908 1207.2156 1212.5613 1219.4065 1246.6891 1249.8539 1274.8321 1277.6154 1281.3042 1289.0600 1292.1572 1306.9921 1310.0573 1319.3851 1327.6094 1329.6845 1342.0491 1350.6273 1351.4409 1376.2033 1384.3387 1392.1675 1432.5034 1453.7802 1459.1239 1461.1599 1464.2539 1468.5833 1470.8155 1473.1463 1480.5258 1481.7725 1486.6560 1488.1410 1519.3558 1582.4522 1631.4144 1643.1302 2943.3983 2947.3239 2949.1082 2951.8643 2954.8957 2961.4655 2963.3081 2963.9996 2968.9537 2972.0766 2982.3097 2989.1334 2996.7895 3007.9321 3019.9800 3035.7358 3044.5144 3055.3194 3062.9171 3065.7707 3074.0104 3103.9092 3105.7341 3126.3933 3133.6166 3569.9202 3710.8310
redmass: 2.6517 3.6302 4.2641 3.0445 2.0100 3.7524 2.3884 1.9082 3.5694 2.1449 2.5216 2.8322 1.1513 2.3662 1.1975 3.3310 2.4662 1.2235 3.3144 1.0473 3.0329 2.5635 2.6391 2.6821 2.3075 3.0716 3.0709 3.1663 2.7430 6.6109 1.0653 3.3472 1.0946 1.1678 3.8142 1.5139 1.3640 1.7292 2.1164 3.8826 1.3025 1.1804 1.4852 1.6897 1.3613 1.3614 1.5086 3.7306 3.6462 3.2021 1.4537 1.2572 2.8679 3.5785 2.2739 1.2928 2.1902 1.1967 2.3553 1.7232 1.9409 1.0951 1.2875 1.5424 2.3125 1.3379 1.3397 1.1923 1.0774 1.2717 1.1051 1.1366 1.4818 2.6338 1.2530 1.4601 1.4307 1.5273 1.6770 1.5905 1.2187 5.4211 1.2154 3.2170 1.0726 1.0732 1.0699 1.0824 1.0470 1.0724 1.0818 1.0815 1.0715 1.0870 1.0640 3.1291 6.6562 1.6399 2.4524 1.0616 1.0588 1.0589 1.0731 1.0657 1.0600 1.0574 1.0377 1.0366 1.0591 1.0961 1.0970 1.1009 1.1018 1.1043 1.1048 1.1046 1.0993 1.0990 1.0993 1.0985 1.0865 1.0864 1.0962 1.0971 1.0446 1.1040
irintensity: 0.0037 0.0704 0.3060 0.1811 0.0687 0.8069 0.0970 0.0243 1.8965 0.1253 0.5875 0.5653 0.0758 1.4268 0.3718 1.2984 1.9524 310.2416 9.4519 0.0127 0.9451 1.0420 1.3762 0.0237 0.7338 0.4553 0.4970 10.9461 19.0165 0.2119 11.7127 0.4344 0.2510 1.7130 8.3869 0.6058 0.9830 4.1977 54.8788 16.9809 1.7450 4.0421 0.3425 3.2576 0.5742 0.0801 0.1911 0.4138 0.0563 1.7992 0.0481 1.2147 0.3584 0.7418 1.6045 0.7347 0.2217 20.0176 4.4129 15.4205 2.1025 15.8721 16.8296 1.1850 0.4056 0.2554 0.9650 0.5525 0.3398 0.4406 0.4200 0.1660 16.3089 52.2614 0.4639 6.3846 3.4212 0.6016 0.5251 1.4686 19.1717 9.7313 15.3729 0.3585 0.3751 0.1715 0.1251 0.0682 1.2776 2.0891 3.8965 4.1387 3.9535 7.0867 39.7482 149.6710 3.2728 9.3262 257.7231 8.9261 2.8605 1.5173 11.4229 3.3676 77.1993 16.8423 64.9712 30.1629 134.2745 2.0367 2.2226 9.5622 0.5008 2.1957 34.2477 187.4581 7.0107 94.2600 68.3429 57.5764 0.1431 43.8397 56.0100 2.1071 64.6076 18.5839
temp: 298.150 k
press: 1.00000 atm
elementType: 7 6 6 6 6 6 6 6 6 6 6 6 6 6 6 6 6 1 1 1 1 1 1 1 1 1 1 1 1 1 1 1 1 1 1 1 1 1 1 1 1 1 1 1
symmnumber: 1
zpe: 1030247.0 jmol-1
zpe.correction: 0.392400 hartree
zpe.thermalcorrener: 0.411899 hartree
zpe.thermalcorrenthalpy: 0.412843 hartree
zpe.thermalcorrgfe: 0.341092 hartree
zpe.sumelectzpe: -679.321551 hartree
zpe.sumelectthermal: -679.302052 hartree
zpe.sumelectthermalent: -679.301108 hartree
zpe.sumelectthermalfe: -679.372859 hartree
dipole: -1.5509 0.8481 -0.4736
dipole: 1.8300
quadrupole: -85.9401 -107.6040 -102.0965
quadrupole: -10.9142 4.6178 3.5458
quadrupole: 12.6067 -9.0572 -3.5496 -10.9142 4.6178 3.5458
hfenergy: -679.713951 hartree
pointgroup: C01 [X(C16H27N1)]
dipole: -0.6095324 0.3069996 -0.2293422 debye
polarizability: 248.6607867|-23.9926299|149.8492229|15.4679953|10.1150599|152.8943953 unknown
InChI: InChI=1S/C16H27N/c1-14(2)8-6-4-3-5-7-9-15-10-12-16(17)13-11-15/h10-14H,3-9,17H2,1-2H3
charge 0 multiplicity 1
44 atoms
N  -7.127947 1.168353 -0.725706
C  4.290323 0.189385 -0.270734
C  3.118415 -0.613724 0.33866
C  5.676657 -0.331452 0.172531
C  1.729796 -0.080655 -0.080682
C  6.886332 0.371919 -0.50064
C  0.555112 -0.885997 0.519163
C  -0.829736 -0.328213 0.123121
C  -2.010054 -1.147198 0.71662
C  6.972037 1.871509 -0.125394
C  8.204718 -0.351691 -0.135846
C  -3.37188 -0.570967 0.358026
C  -4.002518 0.397191 1.18137
C  -4.039399 -0.940752 -0.838108
C  -5.239359 0.976737 0.833568
C  -5.276711 -0.37387 -1.204809
C  -5.898802 0.600277 -0.371817
H  4.177723 1.255452 0.012123
H  4.222507 0.150834 -1.378693
H  3.208781 -1.679285 0.03981
H  3.198572 -0.59486 1.446057
H  5.732765 -1.418865 -0.046198
H  5.772369 -0.230871 1.275159
H  1.652376 -0.09002 -1.188164
H  1.638331 0.982273 0.226762
H  6.747469 0.300435 -1.601365
H  0.643624 -0.894079 1.626252
H  0.632391 -1.945428 0.194932
H  -0.918151 0.724792 0.459796
H  -0.92401 -0.308267 -0.981797
H  -1.891524 -1.184692 1.818295
H  -1.930117 -2.192089 0.354506
H  7.848286 2.349157 -0.602624
H  6.072156 2.428709 -0.441869
H  7.078312 1.990349 0.970887
H  8.379333 -0.316458 0.957285
H  9.073558 0.121212 -0.630943
H  8.176666 -1.415447 -0.438575
H  -3.517136 0.702002 2.117721
H  -3.582958 -1.692113 -1.49578
H  -5.702798 1.719562 1.495513
H  -5.769183 -0.685814 -2.134771
H  -7.569577 1.863673 -0.132314
H  -7.596447 0.900087 -1.585426
