program: Gaussian 09
title: 000000623
version: EM64L-G09RevD.01
frameworkgroup: C1[X(C9H15N3O10P2)]
method: RPBEPBE
basis: SDD
operation: Freq
keyword: #p
keyword: freq=noraman
keyword: PBEPBE/SDD
title: #p freq=noraman PBEPBE/SDD
converged: YES YES NO NO
title: Mulliken charges:
elementType: P P O O O O O O O O O O N N N C C C C C C C C C H H H H H H H H H H H H H H H
charge: 1.451163 1.428049 -0.304869 -0.543535 -0.604121 -0.278205 -0.768298 -0.651058 -0.577726 -0.648446 -0.683463 -0.545162 -0.216355 -0.042409 -0.619727 -0.132691 0.005308 -0.577557 0.015358 -0.372723 -0.082260 0.065069 -0.339966 0.188584 0.318043 0.250336 0.310421 0.262970 0.284410 0.263431 0.275519 0.397594 0.287406 0.234921 0.428281 0.321414 0.343782 0.411404 0.445108
chargesum: 0.00000
title: Mulliken charges with hydrogens summed into heavy atoms:
elementType: P P O O O O O O O O O O N N N C C C C C C C C C
charge: 1.451163 1.428049 -0.304869 -0.145941 -0.604121 -0.278205 -0.768298 -0.222777 -0.577726 -0.237042 -0.238355 -0.545162 -0.216355 -0.042409 0.045469 0.185352 0.255644 -0.004166 0.299769 0.166227 0.205146 0.065069 -0.105045 0.188584
polarizability: 2.86322803e+02 -8.28722643e+00 1.86321636e+02 1.20760774e+01 -9.56029739e+00 1.40043611e+02
1716.lowfreq: -11.2875 -2.6884 -0.0015 -0.0014 -0.0008 4.8068 12.3397 20.5046 30.5442
frequency: 12.0765 20.2624 30.4868 38.3320 48.7401 64.8983 81.6663 84.7924 103.9804 116.7691 124.0310 154.5560 173.8927 186.2309 202.9227 215.8598 219.2189 239.9119 253.7560 264.8483 286.8786 304.1648 310.1994 322.6129 325.5612 338.6368 342.9214 354.1479 368.0560 385.0747 403.3994 420.2871 438.7011 444.2799 483.1567 513.9919 521.4310 537.1314 561.6830 575.1031 583.2088 600.5691 632.9146 694.9491 695.1050 711.2839 727.2300 735.0006 744.9771 760.7133 775.3172 781.7533 786.8357 820.2320 834.2228 855.6056 876.9385 889.4169 919.6480 932.0784 960.2156 960.5254 981.2281 981.5570 1003.0755 1021.2722 1044.7302 1062.6300 1064.6338 1091.9064 1122.2290 1133.7777 1158.5044 1175.2563 1183.2326 1202.7176 1209.6910 1218.3495 1249.0071 1264.6613 1283.9778 1293.6247 1312.9560 1331.5827 1339.5331 1348.8589 1365.7162 1375.5062 1384.9821 1463.6230 1471.4043 1475.2312 1503.9332 1587.3412 1629.7591 1640.6506 2744.9925 2996.8432 3028.6396 3044.6422 3046.4172 3047.8099 3103.7514 3121.8807 3174.6422 3183.9323 3195.9296 3540.5581 3584.5845 3610.4474 3697.6018
redmass: 6.9356 9.0869 9.7069 6.2482 6.3756 6.2589 6.4188 5.8365 6.3149 2.9803 4.2252 5.0089 5.8115 7.3117 5.6565 9.1568 5.4027 4.4970 5.9504 4.0359 3.6626 3.2443 1.7058 4.2183 6.2944 4.7233 7.9284 4.3033 8.6071 6.9420 11.2473 3.0197 2.7654 1.1931 6.0613 7.4274 4.6729 3.2294 8.4664 1.2086 8.7827 6.3672 3.9285 4.4932 4.8820 1.9266 2.5060 7.1880 6.0187 4.6549 2.0008 4.2514 7.0038 4.6813 9.2850 2.4643 3.4431 1.3226 3.9717 2.9521 6.1573 1.3184 1.5041 1.7572 2.6905 2.1090 2.5996 10.7506 2.4517 2.5783 2.4535 4.1514 1.4367 1.8633 1.3425 1.1519 3.9431 1.1522 1.3159 1.2684 1.3611 1.5076 1.3742 1.1870 1.6055 1.2967 1.4302 1.2797 1.7500 1.1219 1.1030 4.0127 4.6517 2.6379 1.8832 7.8646 1.0720 1.0849 1.0671 1.0869 1.0659 1.0788 1.1021 1.1080 1.0887 1.0666 1.1001 1.0454 1.0664 1.0665 1.1045
irintensity: 2.4048 1.0297 2.4362 5.0170 1.2916 5.5600 14.0916 14.7729 9.8291 37.5667 10.8665 6.5996 1.3041 5.5285 40.5160 7.1559 29.4029 15.4995 1.6805 26.1806 0.5777 17.0025 84.3724 7.2817 40.7253 31.6604 37.3300 5.7323 37.9567 17.2191 28.5071 1.9260 12.4126 143.8459 55.2784 19.8259 6.2725 10.6691 6.9247 150.5681 88.4757 15.2949 9.8749 99.3938 110.4664 35.7121 24.7106 8.3847 6.6306 271.5525 79.2156 29.1700 259.3789 20.1610 431.8181 26.2069 28.5594 162.6125 61.5568 61.6551 279.2315 2.0669 63.6146 20.0760 114.2248 1.0558 41.5825 134.3663 127.2851 17.1919 19.9795 151.8031 63.6743 22.3053 11.4009 177.2858 17.4739 28.6963 85.4106 2.0039 4.8193 36.9432 36.2911 241.9756 42.8205 1.3757 5.8023 121.1331 4.1828 23.2799 12.1833 173.9890 107.7179 162.5000 203.8611 806.3611 1577.4117 17.6529 0.6058 5.5505 2.9748 19.2804 4.9754 2.8205 0.8998 518.8565 5.5446 125.5607 86.3873 34.4216 40.9394
temp: 298.150 k
press: 1.00000 atm
elementType: 15 15 8 8 8 8 8 8 8 8 8 8 7 7 7 6 6 6 6 6 6 6 6 6 1 1 1 1 1 1 1 1 1 1 1 1 1 1 1
symmnumber: 1
zpe: 713292.6 jmol-1
zpe.correction: 0.271679 hartree
zpe.thermalcorrener: 0.296922 hartree
zpe.thermalcorrenthalpy: 0.297866 hartree
zpe.thermalcorrgfe: 0.214190 hartree
zpe.sumelectzpe: -1949.049862 hartree
zpe.sumelectthermal: -1949.024619 hartree
zpe.sumelectthermalent: -1949.023675 hartree
zpe.sumelectthermalfe: -1949.107351 hartree
dipole: 8.5642 -4.2479 3.4876
dipole: 10.1761
quadrupole: -177.4991 -148.0887 -164.3901
quadrupole: -30.9230 -5.0415 -7.5932
quadrupole: -14.1731 15.2372 -1.0641 -30.9230 -5.0415 -7.5932
hfenergy: -1949.321541 hartree
pointgroup: C01 [X(C9H15N3O10P2)]
dipole: -3.3079629 -1.3555719 -1.8023552 debye
polarizability: 284.4015422|2.331365|182.4200859|22.3190104|15.411775|145.866422 unknown
InChI: InChI=1S/C9H15N3O10P2/c10-7-1-2-12(9(14)11-7)8-3-5(13)6(21-8)4-20-24(18,19)22-23(15,16)17/h1-2,5-6,8,13,15-16,18H,3-4,10H2
charge 0 multiplicity 1
39 atoms
P  3.585319 0.909533 -0.347126
P  5.868746 -1.093242 0.515867
O  -0.900371 -0.594497 0.486921
O  0.699776 2.032026 0.982009
O  2.786554 -0.674428 -0.11966
O  -4.103318 2.014962 0.580501
O  5.193758 0.392562 -0.21384
O  3.255497 1.728912 1.087074
O  3.199158 1.610967 -1.712277
O  7.337766 -1.170142 -0.319779
O  4.912719 -2.277044 -0.262271
O  6.012554 -1.097484 2.080157
N  -3.197367 -0.055036 -0.014113
N  -5.564065 0.389088 -0.307272
N  -6.952031 -1.238822 -1.202618
C  0.196688 1.417817 -0.287367
C  0.340155 -0.121528 -0.194575
C  -1.322029 1.603152 -0.412143
C  -1.903073 0.481003 0.48484
C  1.500985 -0.716478 0.62197
C  -3.340208 -1.32774 -0.517727
C  -4.335612 0.860734 0.108778
C  -4.576477 -1.777903 -0.942641
C  -5.689365 -0.860676 -0.812666
H  0.774238 1.837768 -1.129984
H  0.370819 -0.527649 -1.225777
H  -1.694811 2.595324 -0.112139
H  -1.628318 1.439246 -1.46091
H  -2.069246 0.828575 1.519247
H  1.306127 -1.788744 0.777064
H  1.60483 -0.220964 1.601931
H  0.19888 2.857704 1.188866
H  -2.436245 -1.940305 -0.538517
H  -4.694502 -2.788234 -1.338155
H  2.255779 2.009233 1.156215
H  -7.144693 -2.159193 -1.587979
H  -7.707467 -0.565089 -1.084283
H  7.272609 -1.136308 -1.308621
H  3.934238 -2.009004 -0.261198
