program: Gaussian 09
title: 000110089
version: EM64L-G09RevD.01
frameworkgroup: C1[X(C11H16N2O3)]
method: RPBEPBE
basis: SDD
operation: Freq
keyword: #p
keyword: freq=noraman
keyword: PBEPBE/SDD
title: #p freq=noraman PBEPBE/SDD
converged: YES YES NO NO
title: Mulliken charges:
elementType: O O O N N C C C C C C C C C C C H H H H H H H H H H H H H H H H
charge: -0.304858 -0.315185 -0.259844 -0.448229 -0.727931 0.149684 0.395917 0.568691 -0.669240 -0.327574 -0.314090 -0.400410 -0.237614 0.203619 -0.802269 -0.487802 0.203673 0.213612 0.233707 0.237866 0.304687 0.196230 0.215134 0.303178 0.285607 0.391880 0.237733 0.266705 0.229005 0.216631 0.231289 0.210195
chargesum: 0.00000
title: Mulliken charges with hydrogens summed into heavy atoms:
elementType: O O O N N C C C C C C C C C C C
charge: -0.304858 -0.315185 -0.259844 -0.145051 -0.050444 0.149684 0.395917 0.568691 -0.465566 -0.089707 0.133230 -0.095723 0.173750 0.203619 -0.068825 0.170313
polarizability: 2.37369126e+02 -2.79381437e+00 1.46329974e+02 -4.26814376e-01 -2.29761227e+00 8.24506894e+01
1716.lowfreq: -80.9564 -15.0776 -0.0009 -0.0009 -0.0001 3.4582 3.9776 29.7486 53.5314
frequency: -80.9543 29.5268 53.5265 59.2567 64.9842 85.3001 112.9398 129.7125 160.2338 201.9927 215.3008 239.7361 251.9488 280.1335 294.9043 312.9271 338.2304 373.2355 417.6808 441.6417 457.9884 496.0277 535.6154 570.6078 574.5875 613.4569 637.8280 649.8765 705.5616 726.9593 737.5687 776.3999 794.5229 823.1804 844.4872 862.8736 907.2154 954.3677 959.8995 985.3084 994.2174 1012.2348 1027.6869 1059.5794 1073.2761 1101.0249 1120.0861 1130.0529 1153.5063 1177.2151 1195.4546 1207.2642 1241.9183 1246.9376 1270.1805 1334.7160 1355.7889 1371.9384 1377.6651 1383.3631 1421.0048 1435.9149 1451.9013 1457.1001 1459.5998 1463.0307 1468.8403 1477.8918 1506.8457 1527.5532 1590.8342 1627.6510 1632.9083 1673.7483 2939.8068 2946.6099 2977.8175 2985.3588 3005.5239 3022.7886 3047.2029 3070.7322 3094.7882 3107.5265 3133.1260 3149.9763 3209.7112 3380.0787 3522.9854 3648.6343
redmass: 1.0517 4.5191 3.2413 5.1150 4.1552 3.5148 3.3296 3.1392 3.2470 4.0266 1.8093 3.7474 2.4088 2.8217 6.9215 4.0458 3.1154 1.2442 3.1893 3.6276 2.9042 3.6130 3.6400 5.5344 3.2265 1.5974 3.2960 2.4909 2.3561 1.3504 2.9785 5.2054 2.5917 1.6780 1.7056 3.2435 5.0236 1.3193 2.7440 2.6377 1.7491 2.7152 1.6563 3.0424 1.7244 2.0030 1.4085 1.4783 1.3675 2.4023 2.0020 1.2815 1.8328 1.1956 1.4920 2.7596 1.3302 1.2360 1.6332 4.4054 2.8389 1.1451 1.1449 1.0782 1.0575 1.0992 1.0483 1.0604 3.1837 2.6382 5.4113 6.2342 4.8331 1.1797 1.0408 1.0479 1.0602 1.0381 1.1041 1.1037 1.1057 1.0985 1.0906 1.0988 1.0978 1.0908 1.0946 1.0618 1.0762 1.0904
irintensity: 0.0419 0.0157 5.3549 8.1998 2.4672 6.3586 1.4615 1.5091 2.1498 2.1648 5.1211 1.1305 4.2930 0.6820 7.5809 9.1719 5.2625 95.7184 24.4822 10.6389 3.2473 1.9207 20.0642 8.0384 5.2118 56.2571 17.3997 0.6302 38.5792 89.9885 3.3273 3.8752 14.8750 0.5833 96.3607 47.4186 3.4696 2.0627 18.0632 42.4112 11.7143 58.7955 8.5092 67.2870 13.7558 23.2825 17.4638 38.6090 10.9629 128.4268 12.5236 12.7606 93.6221 11.3991 9.0917 1.7846 3.3885 28.3936 45.4497 274.6220 78.7478 2.3092 18.6396 13.8301 15.4450 15.9756 18.8839 9.3756 401.5446 27.8651 14.1630 298.8016 38.4816 151.8129 47.5074 107.7164 54.3287 12.1023 73.5968 55.4869 29.4710 18.3205 24.0644 24.7214 8.6338 8.7988 8.0069 570.3395 9.1829 43.1654
temp: 298.150 k
press: 1.00000 atm
elementType: 8 8 8 7 7 6 6 6 6 6 6 6 6 6 6 6 1 1 1 1 1 1 1 1 1 1 1 1 1 1 1 1
symmnumber: 1
zpe: 681567.2 jmol-1
zpe.correction: 0.259595 hartree
zpe.thermalcorrener: 0.275936 hartree
zpe.thermalcorrenthalpy: 0.276881 hartree
zpe.thermalcorrgfe: 0.214878 hartree
zpe.sumelectzpe: -762.714027 hartree
zpe.sumelectthermal: -762.697686 hartree
zpe.sumelectthermalent: -762.696742 hartree
zpe.sumelectthermalfe: -762.758744 hartree
dipole: 4.6389 -4.5210 1.6051
dipole: 6.6735
quadrupole: -73.2728 -85.8717 -98.9676
quadrupole: 17.3499 -0.7026 2.0181
quadrupole: 12.7645 0.1657 -12.9302 17.3499 -0.7026 2.0181
hfenergy: -762.9736223 hartree
pointgroup: C01 [X(C11H16N2O3)]
dipole: 1.8108397 -1.5886252 1.044335 debye
polarizability: 237.316413|-2.0758939|142.2427029|3.3868891|-15.8057099|86.590674 unknown
InChI: InChI=1S/C11H16N2O3/c1-8(14)13-9-3-4-11(10(12)7-9)16-6-5-15-2/h3-4,7,13H,5-6,12H2,1-2H3
charge 0 multiplicity 1
32 atoms
O  2.113762 1.075496 -0.621779
O  4.349806 -0.528901 0.460468
O  -4.568564 1.173547 -0.406099
N  -3.223329 -0.659838 0.194758
N  1.580408 -1.518248 0.364774
C  0.770582 0.67211 -0.369268
C  0.521631 -0.658276 0.103713
C  -1.900343 -0.160597 -0.014147
C  -0.83308 -1.048059 0.280401
C  -0.291839 1.53936 -0.665227
C  2.91912 1.420497 0.574172
C  -1.639054 1.147484 -0.498397
C  4.340303 0.93594 0.325176
C  -4.44751 -0.018589 0.00356
C  -5.657754 -0.898665 0.332523
C  5.593978 -1.133771 -0.015075
H  -1.050361 -2.064043 0.639845
H  2.91156 2.520837 0.706651
H  2.499868 0.946027 1.482225
H  -0.052398 2.53852 -1.044981
H  -2.465498 1.819245 -0.728668
H  5.041564 1.385415 1.061479
H  4.65335 1.22702 -0.699821
H  -3.273322 -1.62428 0.531678
H  1.398126 -2.447587 0.73226
H  2.556445 -1.217407 0.240613
H  -5.73676 -1.746516 -0.373372
H  -6.567154 -0.286626 0.246788
H  -5.599698 -1.308092 1.358247
H  5.759383 -0.918264 -1.090725
H  5.489133 -2.220347 0.130405
H  6.464547 -0.768292 0.567823
