program: Gaussian 09
title: 000110068
version: EM64L-G09RevD.01
frameworkgroup: C1[X(C13H9FO2)]
method: RPBEPBE
basis: SDD
operation: Freq
keyword: #p
keyword: freq=noraman
keyword: PBEPBE/SDD
title: #p freq=noraman PBEPBE/SDD
converged: YES YES NO NO
title: Mulliken charges:
elementType: F O O C C C C C C C C C C C C C H H H H H H H H H
charge: -0.168217 -0.286795 -0.204330 0.217240 -0.463656 0.430707 0.356514 0.172943 -0.369981 -0.320490 -0.354988 -0.380759 -0.199877 -0.191513 -0.244079 -0.208778 0.313397 0.243817 0.263235 0.264357 0.261071 0.233041 0.233405 0.233721 0.170016
chargesum: 0.00000
title: Mulliken charges with hydrogens summed into heavy atoms:
elementType: F O O C C C C C C C C C C C C C
charge: -0.168217 -0.286795 -0.204330 0.217240 -0.150259 0.430707 0.356514 0.172943 -0.126164 -0.057255 -0.090631 -0.119688 0.033163 0.041891 -0.010358 -0.038762
polarizability: 2.03722287e+02 -9.15816047e+00 1.53136908e+02 1.23309205e+01 8.56898460e+00 8.73816423e+01
1716.lowfreq: -8.9415 -0.0011 -0.0010 -0.0009 2.1974 4.6810 25.6960 34.1212 67.0332
frequency: 25.6144 34.0944 67.0308 93.6676 158.7452 187.1394 197.3393 210.8181 243.5155 334.0248 360.8081 390.1314 410.7747 444.6447 453.9298 476.8854 554.1754 575.1698 601.4584 605.0162 615.6777 690.8873 705.7961 721.9231 758.6934 778.6219 813.4243 819.4339 836.9666 904.2212 916.9973 940.4040 967.9426 971.0512 987.9194 990.9431 993.0629 1019.6489 1077.5952 1096.8623 1135.9902 1166.5467 1172.5868 1188.0776 1191.4283 1251.5420 1264.0033 1308.2856 1365.5953 1383.2105 1403.7968 1416.6066 1441.9675 1471.4302 1490.1566 1586.2783 1591.8690 1597.4364 1607.8337 1623.6765 2876.2606 3134.9613 3140.3928 3144.0095 3156.6593 3158.8198 3167.3732 3177.3505 3178.0879
redmass: 5.2675 4.6538 5.4861 10.5546 6.7847 4.5432 3.4230 9.0236 5.7386 6.2375 4.7307 8.2540 2.9092 4.3482 4.0713 3.5570 6.1225 5.2253 5.9145 6.3133 6.7608 2.4337 4.7614 3.8528 2.0931 3.3972 1.3891 5.4846 1.2655 1.3811 1.3812 1.3596 3.3282 1.3735 5.8712 1.3737 1.7387 2.1046 1.5044 2.7497 1.6261 1.3932 1.1268 2.0534 2.0809 1.4513 4.0320 1.3310 1.8207 7.6582 6.5922 2.6434 2.2851 2.2670 3.3015 8.4644 6.6056 6.3595 7.0523 7.0815 1.0851 1.0852 1.0899 1.0891 1.0928 1.0922 1.0969 1.1005 1.0957
irintensity: 1.9066 1.7265 1.5640 5.5916 3.6650 2.2639 5.2308 2.8634 3.6521 1.1962 4.3307 1.8364 0.3581 3.4151 6.0688 19.3635 7.0708 6.6242 11.5785 11.0610 4.1186 33.0313 5.4152 6.4100 58.1981 41.6369 52.6122 35.7937 0.6951 13.0919 3.3869 2.7131 20.8540 0.4458 1.6723 2.3796 9.0722 13.1637 12.0922 83.2638 10.7134 63.6465 18.9033 50.7005 84.2749 31.9067 297.3108 0.1763 36.8695 4.9278 51.0325 116.0732 3.5782 124.4212 122.4156 174.3497 61.1771 35.2198 16.3900 80.7742 131.5467 1.3037 4.7604 8.2528 18.2281 12.2407 12.3080 6.9559 3.0662
temp: 298.150 k
press: 1.00000 atm
elementType: 9 8 8 6 6 6 6 6 6 6 6 6 6 6 6 6 1 1 1 1 1 1 1 1 1
symmnumber: 1
zpe: 477461.3 jmol-1
zpe.correction: 0.181855 hartree
zpe.thermalcorrener: 0.195103 hartree
zpe.thermalcorrenthalpy: 0.196048 hartree
zpe.thermalcorrgfe: 0.140157 hartree
zpe.sumelectzpe: -749.936818 hartree
zpe.sumelectthermal: -749.923570 hartree
zpe.sumelectthermalent: -749.922626 hartree
zpe.sumelectthermalfe: -749.978516 hartree
dipole: 0.5503 -0.4725 0.6908
dipole: 1.0016
quadrupole: -66.9138 -109.3678 -88.9671
quadrupole: -5.7091 3.3372 5.2652
quadrupole: 21.5024 -20.9516 -0.5508 -5.7091 3.3372 5.2652
hfenergy: -750.1186736 hartree
pointgroup: C01 [X(C13H9F1O2)]
dipole: -0.1942515 0.2715233 0.2093604 debye
dipolederiv: -0.2394094 -0.2459233 0.0545696 -0.174918 -1.0596313 0.186978 0.0429806 0.1980854 -0.1555874 -2.2556789 0.1389267 0.0078091 0.4679599 -0.3371425 0.0699955 0.2581628 0.0510103 -0.2413743 -0.3992506 0.3298802 -0.0349046 -0.1369737 -1.102951 0.1294655 0.0300019 0.0864687 -0.3346752 1.8125066 0.2235215 -0.1133875 0.3197824 -0.2155637 0.0611092 -0.4995243 0.0659734 0.0737599 -0.2666814 0.218624 -0.040263 -0.3366716 0.036994 -0.0039727 0.1086756 -0.0552304 -0.1069916 -0.0714298 -0.3505261 0.0618918 -0.2346987 -0.6862723 0.1358862 0.0400336 0.1652991 -0.0160557 1.3783593 -0.3003018 0.0932732 -0.9353872 0.2322676 -0.0717524 0.2354025 -0.0516462 0.2018844 0.0607788 0.186315 -0.0623608 0.2702604 1.2182741 -0.2355544 -0.0877836 -0.2383676 0.1218306 -0.0933038 -0.0424582 -0.0195093 0.0811585 0.1467772 -0.0741923 -0.0247123 -0.058071 -0.1570653 -0.0900261 -0.2442856 0.0382343 -0.0740504 -0.0950124 0.0127031 0.0075599 0.0247069 -0.1402235 -0.2508177 -0.0126484 -0.0464781 0.1474402 -0.1564243 0.0009087 -0.2375097 0.0487254 -0.0993522 -0.3773909 0.0199927 -0.0317555 0.0483131 -0.1107557 -0.0557257 0.0428766 -0.0961177 0.0073988 0.0424365 -0.0660851 -0.0413691 -0.0990472 -0.0577948 -0.0781388 0.0092274 -0.0863601 0.1185653 0.0819241 -0.0784465 -0.0636843 -0.0950181 -0.0886454 -0.0430985 -0.0926462 -0.0244252 0.0688951 -0.0466437 -0.1037695 0.0440627 -0.0695915 -0.10186 -0.0421106 0.0276879 -0.0420854 -0.1351219 0.7572876 0.0716573 -0.1009163 0.3302183 1.5761582 -0.258079 -0.147405 -0.2552905 0.1614847 0.1006782 0.0235041 0.0104378 0.1262771 0.0916479 0.003625 0.0196265 0.0143381 0.1408357 -0.0619181 -0.0183051 0.0338601 -0.0570025 0.090731 0.0210586 0.0487859 0.0189199 0.1569474 0.0483468 0.071335 0.0029109 0.0656793 0.0086878 0.0200219 0.0107652 0.0221377 0.1731936 0.0302575 0.0448463 0.0907393 0.0578201 0.1121026 0.0063396 0.1289799 -0.0021521 0.0526381 0.1356324 0.0423963 -0.0211313 0.0355604 0.1221052 0.0731543 -0.0197365 0.0661154 -0.0097956 0.0773358 0.0263925 -0.0023723 0.0427084 0.1126418 0.0834443 -0.0322725 0.0786778 -0.0690148 -0.0267647 0.0395618 0.1051119 0.0517315 0.1347618 0.0055923 0.114725 0.0018871 0.0057421 -0.0479227 0.1080142 -0.0291525 0.1245891 0.0937985 0.0483312 -0.0325192 0.0439708 0.0855362 -0.2983058 -0.0822182 0.0643838 0.0438603 0.0351055 0.004011 0.0486181 0.0234299 0.0965457 unknown
polarizability: 201.260182|-17.033747|145.4541936|-11.9724917|-24.1553734|97.5264623 unknown
InChI: InChI=1S/C13H9FO2/c14-12-7-6-10(9-15)8-13(12)16-11-4-2-1-3-5-11/h1-9H
charge 0 multiplicity 1
25 atoms
F  -1.189332 3.139852 -0.581461
O  0.670283 1.171309 -0.570012
O  -2.155791 -3.14987 0.642354
C  -0.640721 0.799809 -0.251836
C  -1.075945 -0.508938 0.027963
C  -2.452625 -0.764072 0.268415
C  1.779288 0.364171 -0.176279
C  -1.612851 1.83867 -0.297221
C  -3.401369 0.289477 0.220107
C  -2.976492 1.602947 -0.068271
C  1.906223 -0.152466 1.132429
C  2.800789 0.208345 -1.134841
C  3.081354 -0.85876 1.472323
C  3.972792 -0.4947 -0.777195
C  4.115166 -1.034108 0.522648
C  -2.910672 -2.14386 0.566781
H  -0.375262 -1.349688 0.058669
H  -4.461094 0.081745 0.406165
H  -3.675784 2.442468 -0.116021
H  1.11409 0.000902 1.872157
H  2.668139 0.638048 -2.132013
H  3.189128 -1.264592 2.483925
H  4.77158 -0.621471 -1.515747
H  5.023485 -1.58172 0.794562
H  -4.014177 -2.242697 0.728598
