program: Gaussian 09
title: 000119162
version: EM64L-G09RevD.01
frameworkgroup: C1[X(C6H8N2O2)]
method: RPBEPBE
basis: SDD
operation: Freq
keyword: #p
keyword: freq=noraman
keyword: PBEPBE/SDD
title: #p freq=noraman PBEPBE/SDD
converged: YES YES NO NO
title: Mulliken charges:
elementType: O O N N C C C C C C H H H H H H H H
charge: -0.605075 -0.605076 -0.116205 -0.116206 -0.381139 -0.381139 -0.517410 -0.517409 -0.023192 -0.023193 0.168433 0.114282 0.168432 0.114282 0.214167 0.146139 0.214166 0.146140
chargesum: -2.00000
title: Mulliken charges with hydrogens summed into heavy atoms:
elementType: O O N N C C C C C C
charge: -0.605075 -0.605076 -0.116205 -0.116206 -0.098424 -0.098424 -0.157103 -0.157103 -0.023192 -0.023193
polarizability: 1.41540659e+02 8.39941121e-05 1.05714353e+02 6.78748084e-01 3.97186993e-05 6.06735955e+01
1716.lowfreq: -17.6644 -15.6942 -0.0007 -0.0002 0.0006 8.7451 67.0402 106.2362 172.1191
frequency: 66.8352 106.2187 172.1101 186.4378 273.0707 292.4862 331.9297 379.6685 387.6336 415.9146 436.8717 551.8143 589.4761 687.1349 732.2824 811.5634 842.0888 852.1027 900.5764 938.5599 1005.0546 1013.2638 1043.7071 1054.0598 1069.8186 1102.6752 1109.0707 1189.9811 1202.7584 1243.0107 1261.9218 1263.4915 1301.7205 1309.3233 1366.4493 1397.3021 1440.6387 1446.2660 1463.2263 1467.2260 2843.1181 2852.6319 2860.3212 2879.0388 2911.3831 2912.8876 2943.3136 2968.0417
redmass: 3.4705 3.6031 3.8251 10.1103 5.2080 2.1302 4.9833 5.0459 4.8752 2.5668 4.9880 5.1698 2.5355 5.8836 4.8699 1.5015 2.8579 2.1194 1.4125 2.3657 8.2546 3.9451 1.5600 1.2836 1.1932 3.5692 2.8497 1.6077 1.7271 3.9443 1.4409 1.3599 1.3935 1.4860 6.5643 7.2194 1.0991 1.0939 1.0859 1.1070 1.0634 1.0623 1.0623 1.0696 1.0941 1.0933 1.0893 1.0948
irintensity: 1.6730 2.8288 1.7652 8.7416 2.9170 1.5375 4.5933 6.8438 6.5661 5.8857 4.8718 0.4478 12.6965 13.8780 7.0127 0.0807 90.5154 13.0607 16.8591 70.1726 48.1826 206.7648 7.2896 64.6511 28.7014 10.0950 17.9684 12.0102 17.7044 0.6125 1.8667 0.8377 0.2085 0.9861 80.1301 1.0645 2.8627 1.6488 6.7936 3.6185 59.6821 0.3732 195.3950 498.8140 42.7233 62.7905 0.0186 211.6654
temp: 298.150 k
press: 1.00000 atm
elementType: 8 8 7 7 6 6 6 6 6 6 1 1 1 1 1 1 1 1
symmnumber: 1
zpe: 346178.2 jmol-1
zpe.correction: 0.131852 hartree
zpe.thermalcorrener: 0.141108 hartree
zpe.thermalcorrenthalpy: 0.142052 hartree
zpe.thermalcorrgfe: 0.097303 hartree
zpe.sumelectzpe: -492.439988 hartree
zpe.sumelectthermal: -492.430733 hartree
zpe.sumelectthermalent: -492.429788 hartree
zpe.sumelectthermalfe: -492.474537 hartree
dipole: -0.0001 10.8213 0.0000
dipole: 10.8213
quadrupole: -122.7391 -94.2583 -65.4417
quadrupole: -0.0001 -2.7016 0.0000
quadrupole: -28.5927 -0.1119 28.7047 -0.0001 -2.7016 0.0000
hfenergy: -492.5718401 hartree
pointgroup: C01[X(C6H8N2O2)]
dipole: 0.0000887 -4.2574156 -0.0001065 debye
dipolederiv: -1.7650467 0.5765884 0.0524811 -0.063971 -0.5377145 -0.0259909 -0.2333888 0.05594 -0.4969664 -1.7650199 -0.5766513 0.0524501 0.0639183 -0.5377392 0.0259918 -0.2333851 -0.0559546 -0.4969691 0.9303903 -0.5908012 -0.057333 -0.1778354 -0.2287549 0.0234464 0.1536467 -0.0410677 -0.2668498 0.9303519 0.5908606 -0.0572997 0.1778881 -0.2287175 -0.023447 0.1536577 0.0410771 -0.2668494 0.1077919 0.028781 -0.009533 0.1100126 0.2091616 0.0814424 -0.0127902 0.0292345 0.1550373 0.1077977 -0.0287844 -0.0095304 -0.1100167 0.2091593 -0.0814394 -0.0127935 -0.0292323 0.155035 -0.1305586 0.1135104 -0.0037907 -0.102265 -0.124078 -0.0632245 -0.0049761 -0.1099163 0.270588 -0.1305545 -0.1135048 -0.0038006 0.1022647 -0.124085 0.0632044 -0.0049743 0.1098971 0.2705981 -0.0073734 0.128121 0.0120445 0.4827638 -0.0738338 0.163921 0.0751867 0.2484635 -0.1519469 -0.007347 -0.1281203 0.0120437 -0.4827637 -0.0738364 -0.1639174 0.0751721 -0.2484565 -0.1519666 0.0121261 0.0125823 0.0342414 0.0076601 0.0606458 0.0124398 0.0808913 0.0967477 -0.2618578 -0.0728384 -0.152669 -0.0467229 -0.1647265 -0.4131993 -0.0992654 -0.0662849 -0.1653787 0.0093387 0.012127 -0.0125865 0.0342406 -0.0076658 0.0606488 -0.012425 0.0808949 -0.0967316 -0.261864 -0.0728522 0.152686 -0.0467207 0.164744 -0.4131968 0.0992447 -0.0662853 0.1653579 0.0093499 -0.1547646 -0.1990811 -0.0091681 0.0389207 0.1816473 0.0317107 0.04257 0.0750124 0.0627209 0.0802724 -0.0048919 0.0277786 0.02117 -0.0738754 -0.0658269 -0.0348524 -0.1194469 -0.3200604 -0.1547737 0.1990624 -0.0091524 -0.038937 0.1816533 -0.0317033 0.0425735 -0.0750038 0.0627142 0.0802718 0.0048985 0.0277715 -0.0211614 -0.0738853 0.0658384 -0.0348623 0.119458 -0.3200516 unknown
polarizability: 141.5026027|0.0009378|105.7143526|1.8806204|0.0011841|60.7116516 unknown
InChI: InChI=1S/C6H8N2O2/c9-7-5-3-1-2-4-6(5)8-10/h1-4H2
charge -2 multiplicity 1
18 atoms
O  -2.894231 1.301902 0.015695
O  2.894285 1.302048 -0.0157
N  -1.519698 1.45473 0.237211
N  1.519743 1.454812 -0.23721
C  -0.768048 -2.192405 0.105238
C  0.768249 -2.192368 -0.105413
C  -1.407501 -0.930515 -0.521042
C  1.407654 -0.930479 0.520918
C  -0.740016 0.375862 -0.054024
C  0.740111 0.375893 0.053969
H  -0.971743 -2.194296 1.19934
H  -1.218559 -3.125694 -0.31659
H  0.971942 -2.194206 -1.199516
H  1.218799 -3.125656 0.316376
H  -2.487434 -0.802336 -0.269053
H  -1.347512 -1.022616 -1.633617
H  2.487578 -0.802245 0.268926
H  1.34768 -1.022631 1.63349
