program: Gaussian 09
title: 000000559
version: EM64L-G09RevD.01
frameworkgroup: C1[X(C5H11N3O)]
method: RPBEPBE
basis: SDD
operation: Freq
keyword: #p
keyword: freq=noraman
keyword: PBEPBE/SDD
title: #p freq=noraman PBEPBE/SDD
converged: YES YES NO NO
title: Mulliken charges:
elementType: O N N N C C C C C H H H H H H H H H H H
charge: -0.207495 -0.119567 -0.633448 -0.657048 -0.379519 -0.444544 -0.428393 -0.069017 0.212842 0.200972 0.228546 0.193222 0.196986 0.276344 0.211295 0.162005 0.318447 0.293591 0.310599 0.334183
chargesum: 0.00000
title: Mulliken charges with hydrogens summed into heavy atoms:
elementType: O N N N C C C C C
charge: -0.207495 -0.119567 -0.021410 -0.012267 0.049998 -0.054336 0.059246 0.092988 0.212842
polarizability: 1.12159114e+02 -2.72166462e+00 7.28423469e+01 -9.36416034e-01 1.12251390e+00 5.87958555e+01
1716.lowfreq: -5.7872 -3.3312 0.0008 0.0009 0.0009 8.3694 30.2629 45.6033 93.2192
frequency: 30.0793 45.5676 93.2089 144.1901 175.6408 197.4628 216.8839 276.7979 361.2612 398.5625 430.2513 440.1972 481.5316 545.6027 559.0821 663.0510 675.7980 695.6493 791.8825 851.1285 884.1056 966.4799 970.1469 1032.0294 1039.0550 1085.6412 1100.3839 1161.5200 1179.8841 1220.1323 1268.7108 1293.7517 1347.0618 1363.3610 1381.3864 1409.6773 1427.8488 1458.8448 1459.7689 1599.6311 1615.4993 1640.3112 1671.7594 2838.5468 2875.7154 2921.1534 2944.9133 2984.4878 3006.6869 3070.3731 3527.3118 3549.2540 3676.2911 3695.1283
redmass: 5.6107 4.5952 2.9407 3.5681 1.7764 3.9930 3.8987 2.0119 1.2752 1.3375 1.1965 1.6557 2.4900 2.0599 1.6001 1.5765 3.5540 3.0391 1.7441 2.5621 1.9888 1.7417 2.6850 1.4396 2.2185 2.1411 2.1424 1.3074 2.1120 1.3401 1.1494 1.4371 1.4105 1.5018 1.2820 4.3013 1.0953 1.0895 1.0892 1.2253 1.2732 6.9290 3.7768 1.0835 1.0555 1.1018 1.0615 1.0947 1.0624 1.1015 1.0449 1.0454 1.1020 1.1026
irintensity: 1.1529 5.5655 8.6029 4.2476 2.7535 4.2969 17.0723 4.7129 76.7255 140.5510 192.6617 27.2340 12.4857 126.3468 134.3232 9.1575 71.7500 6.3181 10.2141 3.5080 12.8016 0.5613 10.7948 11.2700 3.0777 4.9548 1.6296 19.3001 6.4523 25.9883 3.9085 42.8649 35.0091 24.3538 21.1524 125.6562 38.7030 31.8034 11.7098 136.8799 85.7544 186.4557 526.6009 169.7507 83.4597 61.5018 65.1464 17.6262 35.4466 36.4116 21.7377 18.3562 20.5544 19.6569
temp: 298.150 k
press: 1.00000 atm
elementType: 8 7 7 7 6 6 6 6 6 1 1 1 1 1 1 1 1 1 1 1
symmnumber: 1
zpe: 435085.9 jmol-1
zpe.correction: 0.165715 hartree
zpe.thermalcorrener: 0.176555 hartree
zpe.thermalcorrenthalpy: 0.177499 hartree
zpe.thermalcorrgfe: 0.128323 hartree
zpe.sumelectzpe: -435.868846 hartree
zpe.sumelectthermal: -435.858006 hartree
zpe.sumelectthermalent: -435.857062 hartree
zpe.sumelectthermalfe: -435.906238 hartree
dipole: -5.6261 -0.6059 2.3306
dipole: 6.1198
quadrupole: -53.3994 -46.4861 -57.4995
quadrupole: 1.1899 8.1713 1.0701
quadrupole: -0.9377 5.9755 -5.0378 1.1899 8.1713 1.0701
hfenergy: -436.0345611 hartree
pointgroup: C01 [X(C5H11N3O1)]
dipole: -2.1918008 -0.2522394 0.9640517 debye
dipolederiv: -0.7338655 -0.0481208 0.1947581 -0.0043887 -0.3919641 -0.1314703 0.3837306 -0.0766506 -0.636623 -1.565332 0.2983459 -0.0733785 0.1006796 -0.5222306 -0.0056506 -0.0504157 0.0043405 -0.3850643 -0.7601183 0.3787399 -0.2984137 0.4657037 -0.8703704 0.0697814 -0.444127 0.177501 -0.6834274 -0.9238101 -0.293922 0.2515333 -0.4528241 -0.7532678 -0.0501087 0.3237457 0.0086804 -0.6168262 0.0448397 -0.040666 0.0197791 -0.0461386 0.1212378 -0.024274 0.0346012 -0.0314876 0.054666 0.5086383 -0.1859075 0.0585163 -0.2949215 0.3281435 0.0038455 0.0185105 -0.0137508 0.3590865 -0.6111272 -0.1447909 0.1818486 -0.0332859 0.0162638 -0.0725289 0.2713299 -0.0437713 0.0043465 1.0808989 0.2465852 -0.3056795 0.3135712 0.4002813 0.2955666 -0.398871 0.2848384 0.6934344 2.0125542 -0.1875399 0.1239612 -0.030687 1.3649932 -0.2022309 0.126078 -0.143036 0.2256818 -0.038208 0.1085145 -0.0068217 0.1006007 -0.1305719 -0.0014675 -0.0434912 0.0151897 0.0781795 0.0861197 -0.0056636 0.0047987 -0.0455742 0.0580126 0.0613409 -0.0092816 0.0309502 -0.112274 -0.0262459 0.0423626 0.0046299 0.1359133 -0.048748 0.0838546 -0.0282073 0.150992 -0.1860176 -0.0829215 -0.0889074 -0.0866499 0.0269021 -0.1936492 -0.0973933 -0.0321115 -0.1429082 -0.0231623 0.2885593 0.0844884 0.0337216 0.0059445 -0.0452287 -0.0003315 0.0142326 -0.0009846 0.1252582 0.0846474 -0.0219041 -0.0311341 -0.0749718 0.0644661 0.076896 -0.0758452 0.0202929 -0.1269487 -0.100263 -0.1258422 -0.0611526 -0.1642719 -0.1000603 -0.1689 -0.1127551 -0.1886616 -0.1158232 0.1734883 -0.0587243 0.042254 -0.0379067 0.1908848 0.0097235 0.0577889 -0.0369716 0.3605358 0.17822 -0.005942 0.1008162 0.0429322 0.1691705 0.0512539 0.2238117 -0.0451224 0.3173117 0.1625359 -0.0050482 -0.0836889 -0.0532373 0.1873822 0.0658943 -0.1668935 0.0161985 0.3326915 0.2213898 0.0539424 -0.0696982 0.0459603 0.155255 0.0361989 -0.0918298 0.0143611 0.3349748 unknown
polarizability: 112.2536803|-1.5616473|72.7924043|-1.6323336|0.2992324|58.7512315 unknown
InChI: InChI=1S/C5H11N3O/c6-5(7)8-3-1-2-4-9/h4H,1-3,6-7H2
charge 0 multiplicity 1
20 atoms
O  3.778694 0.330531 -0.797338
N  -1.06864 0.202592 0.06896
N  -3.079633 1.370664 -0.270059
N  -3.217325 -0.933089 0.153582
C  1.150943 -0.823918 -0.23501
C  -0.322287 -1.069511 0.155229
C  1.789499 0.256183 0.652639
C  3.171488 0.704213 0.237469
C  -2.379073 0.18459 0.000963
H  1.721921 -1.769627 -0.163325
H  1.197815 -0.497372 -1.289277
H  -0.354259 -1.476241 1.193984
H  -0.741735 -1.858556 -0.514952
H  1.117007 1.143147 0.655129
H  1.84078 -0.063285 1.716944
H  3.652442 1.438401 0.938958
H  -2.492024 2.182451 -0.452384
H  -3.984638 1.530021 0.170142
H  -4.140549 -0.943956 -0.274523
H  -2.814526 -1.819941 0.441868
