program: Gaussian 09
title: 000119106
version: EM64L-G09RevD.01
frameworkgroup: C1[X(C12H7Cl3O)]
method: RPBEPBE
basis: SDD
operation: Freq
keyword: #p
keyword: freq=noraman
keyword: PBEPBE/SDD
title: #p freq=noraman PBEPBE/SDD
converged: YES YES NO NO
title: Mulliken charges:
elementType: Cl Cl Cl O C C C C C C C C C C C C H H H H H H H
charge: -0.040008 -0.032562 -0.051544 -0.425005 0.425927 0.457419 -0.298826 -0.314749 -0.361815 -0.323988 -0.400540 -0.362873 0.310093 -0.100365 -0.200402 -0.224382 0.259973 0.283814 0.253324 0.260461 0.261420 0.263650 0.360979
chargesum: 0.00000
title: Mulliken charges with hydrogens summed into heavy atoms:
elementType: Cl Cl Cl O C C C C C C C C C C C C
charge: -0.040008 -0.032562 -0.051544 -0.064026 0.425927 0.457419 -0.298826 -0.054776 -0.361815 -0.040174 -0.147215 -0.102413 0.310093 -0.100365 0.061018 0.039268
polarizability: 2.32716078e+02 -7.50974892e+00 1.57186849e+02 7.67364627e+00 -5.96763470e+00 9.75762619e+01
1716.lowfreq: -3.5916 -0.0016 0.0011 0.0017 1.3977 8.6816 30.3810 49.1133 67.8649
frequency: 30.3245 49.1087 67.8533 90.3419 144.9860 158.9192 185.1074 212.1258 245.9216 294.3859 296.1717 311.9158 327.8001 364.4091 397.9131 415.1924 431.7920 458.7682 474.3468 527.5397 562.0373 584.2649 593.8516 665.5220 675.6641 707.7945 727.9655 772.9385 809.5417 823.0250 835.3145 868.0045 890.5242 944.9188 958.3933 987.5346 1023.2441 1073.5140 1084.5938 1123.0649 1134.0696 1148.0732 1222.9058 1243.1162 1278.7312 1285.7894 1349.0881 1366.6441 1382.0027 1415.5183 1444.2045 1499.7037 1555.7896 1575.1476 1596.7216 1623.6437 3147.0473 3155.2714 3164.6573 3173.8020 3182.9602 3184.0216 3582.5775
redmass: 13.9272 8.1545 7.3572 11.3550 5.6434 15.5378 7.4553 8.8585 7.9938 8.2072 6.9746 18.4828 5.9023 1.1407 8.0404 4.6393 3.3609 3.7850 4.5793 8.5344 7.6369 4.9137 3.4795 7.0177 7.5234 4.0395 3.9199 7.2991 1.3479 1.4049 1.5915 7.5420 1.4514 1.3415 1.3457 6.7417 4.1534 3.9110 1.7318 1.5757 1.3843 1.2543 1.6127 1.4930 2.3728 1.8463 4.5479 4.5739 4.5052 3.7251 2.6336 3.7540 6.6989 6.3694 8.2801 7.2911 1.0926 1.0893 1.0889 1.0929 1.0967 1.0979 1.0662
irintensity: 0.0335 0.8010 0.6945 0.5682 0.3136 0.1288 0.0497 2.3080 3.2371 0.2884 1.2230 0.0729 2.1759 142.3775 2.9769 6.4417 17.4010 3.4771 28.4724 28.6725 10.0478 3.1438 19.4336 2.5609 5.9509 0.3993 0.3740 5.9032 41.5588 0.2460 58.8640 69.7950 11.2827 0.0488 0.7131 70.9027 31.4950 2.7363 41.2601 139.8103 6.9936 140.8330 40.1702 2.5597 6.4195 11.5872 20.8373 29.5967 10.0977 10.5866 142.5266 61.1672 8.7618 48.5126 7.6952 117.7877 4.7582 3.8915 0.4106 0.4165 3.1883 1.4158 60.3919
temp: 298.150 k
press: 1.00000 atm
elementType: 17 17 17 8 6 6 6 6 6 6 6 6 6 6 6 6 1 1 1 1 1 1 1
symmnumber: 1
zpe: 400199.4 jmol-1
zpe.correction: 0.152428 hartree
zpe.thermalcorrener: 0.166792 hartree
zpe.thermalcorrenthalpy: 0.167736 hartree
zpe.thermalcorrgfe: 0.109472 hartree
zpe.sumelectzpe: -1915.764011 hartree
zpe.sumelectthermal: -1915.749648 hartree
zpe.sumelectthermalent: -1915.748703 hartree
zpe.sumelectthermalfe: -1915.806967 hartree
dipole: -1.4293 -0.0852 -0.2579
dipole: 1.4549
quadrupole: -100.5125 -110.3560 -115.7661
quadrupole: 15.0027 -1.7548 -2.6245
quadrupole: 8.3657 -1.4778 -6.8879 15.0027 -1.7548 -2.6245
hfenergy: -1915.9164393 hartree
pointgroup: C01 [X(C12H7Cl3O1)]
dipole: -0.5654639 -0.0284748 -0.0841976 debye
dipolederiv: -0.2451735 0.0128327 -0.2057732 0.039659 -0.0727641 0.1048334 -0.2030357 0.0970921 -0.6054916 -0.2701634 0.2608848 -0.0397691 0.2403742 -0.592231 0.1191179 -0.0619087 0.1143803 -0.0716096 -0.4236005 0.3029841 -0.0679748 0.4194089 -0.5642671 0.1121161 -0.097727 0.1241552 -0.0911185 -1.7060329 -0.1344244 -0.0659925 -0.1547232 -0.4094273 -0.0931448 -0.036668 -0.0905194 -0.1098131 -0.0480288 0.0386719 -0.1094727 -0.0111726 -0.0768716 0.0624384 -0.0935604 0.0914537 -0.3457993 0.4526983 0.1873433 -0.0723571 0.068553 -0.0807293 0.0486352 0.020938 0.0202224 -0.0168852 0.489546 0.0349217 0.2416811 0.0913243 0.0252932 -0.205976 0.1990741 -0.1837196 0.9331119 0.1704038 0.0003734 0.1446313 -0.0226952 -0.0613201 -0.0570856 0.0812569 -0.0422286 0.1269153 0.1814321 -0.4724714 0.0770879 -0.363064 0.7973408 -0.1818909 0.0801493 -0.1806549 -0.0340197 -0.316468 0.0808221 -0.0136466 0.1633884 -0.1561631 0.0268699 -0.079762 0.0012025 -0.0563091 -0.5643852 -0.0414529 -0.0717935 0.0353472 -0.1615593 0.0145566 -0.3851333 -0.037756 -0.2506305 -0.3960005 -0.0287482 -0.0012628 -0.0991357 -0.1652758 -0.0536042 0.2884965 -0.018055 -0.0008975 1.6382158 0.1768732 0.0258491 0.1802826 0.1201872 -0.0194264 0.0702033 -0.0078227 0.1820583 0.5569853 -0.5038536 0.1182285 -0.6332885 0.8102774 -0.2055391 0.1276763 -0.2260258 -0.0068107 -0.0608152 0.094376 -0.0115453 0.1067192 -0.1254146 -0.000966 0.0074498 0.0083288 -0.0931759 -0.1193363 0.1135358 -0.0229386 0.1006688 -0.1893937 0.01785 -0.021618 0.0213033 -0.117705 0.062786 -0.0253891 0.0637032 -0.0254398 0.1092158 0.053177 0.0792546 0.0374734 0.0001389 0.0884742 -0.0359679 0.0074195 -0.0617702 0.0219862 0.026353 0.0160374 0.0396153 0.126612 -0.0000408 -0.0364415 0.0570966 -0.0476196 0.1589511 0.0474915 0.0615254 0.0493809 0.0259636 0.0381452 -0.0013767 -0.0645629 0.0091993 0.1616111 0.0390847 -0.0689411 0.0355752 0.0086656 0.0556543 -0.0299668 0.0095373 -0.0487916 -0.0081039 0.0429899 0.0127486 0.0415787 0.1498887 -0.0364551 -0.0011565 0.0023715 0.006447 0.0961099 0.0178105 -0.0065701 0.0214947 0.1632979 0.4521592 0.0076301 -0.0005169 0.0063284 0.3625483 0.0843086 0.010114 0.0835255 0.0836134 unknown
polarizability: 230.9106033|-10.6170493|136.7318414|10.7023497|-30.469005|119.8367443 unknown
InChI: InChI=1S/C12H7Cl3O/c13-7-1-4-11(14)10(5-7)9-3-2-8(16)6-12(9)15/h1-6,16H
charge 0 multiplicity 1
23 atoms
Cl -0.594068 -0.714657 2.612855
Cl 0.562118 2.867189 -0.767971
Cl 4.033685 -2.385643 0.514127
O  -4.883426 -0.466535 -0.365861
C  -0.657405 -0.005367 -0.120801
C  0.829345 0.13164 -0.115602
C  -1.410871 -0.415011 1.005119
C  -1.391306 0.241365 -1.316865
C  1.503222 1.340021 -0.429573
C  1.637297 -1.003248 0.173569
C  -2.809183 -0.578532 0.972379
C  -2.784748 0.085414 -1.389923
C  -3.495647 -0.32719 -0.238728
C  3.03753 -0.905706 0.142184
C  2.909048 1.434535 -0.461582
C  3.695351 0.298453 -0.174298
H  -0.840478 0.557705 -2.207908
H  1.155175 -1.954323 0.414067
H  -3.343652 -0.887494 1.877266
H  -3.333138 0.27474 -2.316226
H  3.387563 2.388097 -0.70087
H  4.786806 0.356214 -0.193995
H  -5.299219 -0.748666 0.486436
