program: Gaussian 09
title: 000119104
version: EM64L-G09RevD.01
frameworkgroup: C1[X(C13H14O4)]
method: RPBEPBE
basis: SDD
operation: Freq
keyword: #pfreq=noraman
keyword: PBEPBE/SDD
title: #p freq=noraman PBEPBE/SDD
converged: YES YES NO NO
title: Mulliken charges:
elementType: O O O O C C C C C C C C C C C C C H H H H H H H H H H H H H H
charge: -0.268193 -0.280129 -0.251649 -0.226242 -0.284177 0.522542 -0.398680 -0.363217 0.354701 -0.391204 -0.327540 -0.038070 0.306371 -0.575542 -0.752595 0.259147 -0.748896 0.241275 0.244817 0.244220 0.256150 0.301289 0.235888 0.220617 0.221689 0.248897 0.250230 0.244999 0.253313 0.247022 0.252966
chargesum: 0.00000
title: Mulliken charges with hydrogens summed into heavy atoms:
elementType: O O O O C C C C C C C C C C C C C
charge: -0.268193 -0.280129 -0.251649 -0.226242 -0.042902 0.522542 -0.153863 -0.118998 0.354701 -0.135053 -0.026251 0.197818 0.306371 -0.133236 -0.008468 0.259147 0.004405
polarizability: 2.12951224e+02 1.80636094e+01 1.23855514e+02 3.90131540e+00 1.53853809e+00 1.40699887e+02
1716.lowfreq: -4.9466 0.0009 0.0009 0.0010 4.9341 7.7996 18.1807 28.3952 38.5695
frequency: 18.1495 28.3843 38.5181 44.6795 58.0042 60.6257 70.8875 75.8414 98.2789 140.8699 155.8301 212.3072 225.5572 252.8893 305.8006 328.5410 351.3937 385.0444 409.1743 427.8928 451.3194 534.1837 542.3626 555.2757 564.6575 603.5644 627.9227 634.1444 671.7621 735.2171 745.4246 827.6840 830.7595 840.1349 862.5483 885.9385 890.3365 950.0934 957.8001 964.4319 977.3020 992.1460 994.9036 996.8279 1010.8742 1039.6214 1041.9533 1110.9953 1150.9204 1157.8176 1178.8077 1196.0559 1198.7754 1216.2599 1265.6857 1286.7980 1290.8867 1321.0547 1382.3054 1383.7243 1389.4642 1415.4263 1435.2691 1451.8259 1453.0665 1453.3698 1456.0019 1490.7611 1587.8414 1615.6454 1644.8758 1659.0280 1659.2363 3005.9589 3009.1010 3046.0685 3092.7808 3097.0752 3099.2134 3117.9510 3140.8560 3141.9872 3143.5014 3145.5916 3171.9720 3202.6394 3210.8230
redmass: 4.7571 5.3443 4.0756 3.1588 1.3452 1.3877 2.2877 2.5438 4.2986 4.0350 4.9783 3.2881 4.2049 5.8688 3.9455 4.6478 3.3524 3.7094 2.9382 4.1682 3.4082 3.1608 3.4696 3.0872 3.3859 3.9539 6.0352 3.3555 3.5926 3.9316 5.1944 2.5164 2.7020 1.3613 2.5129 7.0500 7.0759 1.6553 1.3024 1.4231 1.3453 1.7931 1.9274 1.1944 2.6701 1.6419 1.6492 1.4409 2.3668 2.2349 3.5158 2.5522 1.5649 2.5939 1.4445 1.3432 1.2710 1.4668 1.2596 1.2516 4.1785 2.4171 1.2830 1.0607 1.0577 1.0466 1.0533 2.5326 7.1261 6.4333 9.1731 8.1493 5.3307 1.0379 1.0367 1.0862 1.0604 1.0974 1.0948 1.0943 1.1021 1.0906 1.0900 1.1011 1.0961 1.1145 1.0943
irintensity: 2.2632 0.2152 1.5752 2.1333 1.1283 0.4773 2.9985 1.3185 0.7409 1.1572 1.7307 5.5503 8.6251 2.4025 1.1041 2.1019 5.0862 3.0079 0.1404 5.9644 1.3645 20.4360 15.2402 0.0747 4.5368 1.4709 3.4275 11.8321 25.5845 3.1657 15.2466 49.7242 25.5465 9.7662 32.6952 126.7710 87.4516 48.1006 87.1352 15.8724 3.1571 97.0403 53.2592 4.4779 22.0029 9.0806 8.6612 15.8278 288.5022 17.8316 434.0223 193.4733 119.9736 69.9934 19.7000 13.5583 3.7817 0.8771 57.1026 45.8237 15.1352 9.1898 10.2851 24.7273 21.9448 18.6439 22.0089 82.1529 5.6097 23.0169 162.7490 138.7152 63.7133 2.5679 1.3647 8.3682 8.8569 6.4976 9.3866 4.3070 8.5842 8.2632 9.6455 9.7938 3.8840 19.4024 3.1490
temp: 298.150 k
press: 1.00000 atm
elementType: 8 8 8 8 6 6 6 6 6 6 6 6 6 6 6 6 6 1 1 1 1 1 1 1 1 1 1 1 1 1 1
symmnumber: 1
zpe: 627413.1 jmol-1
zpe.correction: 0.238969 hartree
zpe.thermalcorrener: 0.256951 hartree
zpe.thermalcorrenthalpy: 0.257896 hartree
zpe.thermalcorrgfe: 0.189060 hartree
zpe.sumelectzpe: -803.416255 hartree
zpe.sumelectthermal: -803.398273 hartree
zpe.sumelectthermalent: -803.397329 hartree
zpe.sumelectthermalfe: -803.466165 hartree
dipole: -0.6228 0.6249 0.1659
dipole: 0.8977
quadrupole: -86.7749 -95.0360 -100.8189
quadrupole: 3.4835 -13.7525 4.1943
quadrupole: 7.4350 -0.8260 -6.6090 3.4835 -13.7525 4.1943
hfenergy: -803.6552245 hartree
pointgroup: C01 [X(C13H14O4)]
dipole: 0.2190627 0.2768162 0.0112128 debye
polarizability: 214.8499426|-9.0803598|122.5277514|8.0434728|-5.8594913|140.1289304 unknown
InChI: InChI=1S/C13H14O4/c1-4-13(17-10(3)15)11-5-7-12(8-6-11)16-9(2)14/h4-8,13H,1H2,2-3H3
charge 0 multiplicity 1
31 atoms
O  -2.893006 -0.831367 0.322877
O  3.423087 0.372233 -0.235249
O  -2.887993 -1.57258 -1.89478
O  4.048175 -0.179347 1.971593
C  -2.34382 0.509457 -0.138145
C  -0.823681 0.449452 -0.118489
C  -0.087333 0.694951 -1.303089
C  -0.118709 0.158166 1.075521
C  2.000762 0.372183 -0.088813
C  1.320215 0.661674 -1.292294
C  1.291457 0.111236 1.108642
C  -2.92716 1.5301 0.809459
C  -3.090336 -1.792374 -0.679216
C  -3.737093 2.540939 0.412401
C  -3.554733 -3.097845 -0.070216
C  4.351613 0.097855 0.793998
C  5.749435 0.199315 0.225416
H  -2.701593 0.676922 -1.169552
H  -0.616631 0.898617 -2.240219
H  -0.673948 -0.058462 1.994899
H  1.902965 0.846366 -2.199381
H  1.825024 -0.120199 2.030465
H  -2.645526 1.428639 1.866269
H  -4.125525 3.276645 1.124942
H  -4.032963 2.665401 -0.636678
H  -4.252925 -2.915821 0.762059
H  -2.682263 -3.641997 0.335494
H  -4.02899 -3.719561 -0.843915
H  5.872334 -0.509974 -0.61116
H  6.483795 -0.020666 1.013218
H  5.923466 1.212641 -0.176156
