program: Gaussian 09
title: 000119101
version: EM64L-G09RevD.01
frameworkgroup: C1[X(C12H6Cl4O)]
method: RPBEPBE
basis: SDD
operation: Freq
keyword: #p
keyword: freq=noraman
keyword: PBEPBE/SDD
title: #p freq=noraman PBEPBE/SDD
converged: YES YES NO NO
title: Mulliken charges:
elementType: Cl Cl Cl Cl O C C C C C C C C C C C C H H H H H H
charge: -0.028304 -0.023806 -0.044298 -0.043024 -0.408249 0.474833 0.422063 -0.550537 -0.392915 -0.327895 -0.330635 0.434922 -0.059140 -0.348347 -0.105611 -0.190710 -0.218143 0.279137 0.279590 0.288676 0.264263 0.265372 0.362760
chargesum: 0.00000
title: Mulliken charges with hydrogens summed into heavy atoms:
elementType: Cl Cl Cl Cl O C C C C C C C C C C C C
charge: -0.028304 -0.023806 -0.044298 -0.043024 -0.045489 0.474833 0.422063 -0.550537 -0.113779 -0.327895 -0.051045 0.434922 -0.059140 -0.059671 -0.105611 0.073553 0.047230
polarizability: 2.23228572e+02 -3.94575408e-01 1.72941260e+02 5.20615049e+00 -1.61441021e+00 1.17147051e+02
1716.lowfreq: -7.6391 -4.5086 -3.3244 0.0027 0.0033 0.0035 20.2561 51.0109 62.0651
frequency: 20.2066 51.0002 62.0590 86.0628 94.6269 140.4712 178.1049 197.7566 208.2405 227.7040 270.9666 294.4464 306.2229 309.1644 311.8456 323.5651 397.8169 433.1417 455.1858 477.8709 504.7220 525.2503 548.0693 565.5190 605.2734 609.0520 637.3967 707.3399 713.9708 726.5273 815.5258 831.0157 859.7302 866.0123 892.7625 923.8522 950.0088 1010.1625 1024.1905 1081.9928 1093.6943 1122.2017 1143.2050 1170.1060 1245.4907 1251.0377 1305.8688 1353.4067 1368.9460 1385.3157 1406.8124 1436.5510 1470.6084 1558.1071 1579.4775 1593.1352 1602.4875 3165.5662 3169.3660 3176.8174 3184.1793 3190.6033 3494.6582
redmass: 18.4770 10.3496 8.3827 15.0155 13.1085 26.0758 10.0201 7.2010 12.9440 4.5584 7.6554 10.1368 10.1255 7.1080 19.7843 12.4841 5.3848 3.9940 1.1058 4.7025 8.4453 5.8052 7.2506 5.1998 5.0965 5.0201 7.7760 5.5326 5.5006 4.2587 1.3456 8.2450 1.4606 1.4933 1.4689 8.4281 1.3440 7.5180 7.3885 2.0398 1.6804 2.4630 1.5435 1.5062 1.3806 1.2939 3.1812 5.8809 6.8136 3.9893 5.4160 2.5692 4.0939 6.8483 6.3192 8.8000 8.8124 1.0890 1.0930 1.0932 1.0979 1.0936 1.0648
irintensity: 0.0412 0.0738 0.1710 0.2685 0.4744 0.1481 0.0992 0.1859 2.3186 0.0891 5.0888 0.4419 0.7102 1.9117 0.2860 0.2455 2.2621 6.3585 144.6256 14.2291 27.3485 3.4310 44.9270 1.5268 3.7623 8.8684 7.7757 6.3180 12.7371 0.4308 39.1039 46.4961 16.5701 27.3988 11.3679 44.7536 0.0520 39.5378 79.5901 40.5635 27.2770 2.5305 6.0938 224.0093 25.2445 10.8674 5.6455 8.7028 5.2433 62.2518 72.2669 79.1162 45.0206 13.3671 50.1620 78.3089 25.7229 0.2808 0.2066 0.1902 1.1593 1.3735 58.7764
temp: 298.150 k
press: 1.00000 atm
elementType: 17 17 17 17 8 6 6 6 6 6 6 6 6 6 6 6 6 1 1 1 1 1 1
symmnumber: 1
zpe: 375103.9 jmol-1
zpe.correction: 0.142870 hartree
zpe.thermalcorrener: 0.158499 hartree
zpe.thermalcorrenthalpy: 0.159443 hartree
zpe.thermalcorrgfe: 0.097730 hartree
zpe.sumelectzpe: -2375.153351 hartree
zpe.sumelectthermal: -2375.137722 hartree
zpe.sumelectthermalent: -2375.136778 hartree
zpe.sumelectthermalfe: -2375.198490 hartree
dipole: -1.5173 -1.1360 -0.0716
dipole: 1.8968
quadrupole: -124.6717 -125.3054 -126.0631
quadrupole: 1.0656 -7.0140 1.5473
quadrupole: 0.6750 0.0413 -0.7164 1.0656 -7.0140 1.5473
hfenergy: -2375.2962205 hartree
pointgroup: C01 [X(C12H6Cl4O1)]
dipole: -0.5977505 -0.3997452 0.199563 debye
dipolederiv: -0.2548559 -0.179544 0.0331295 -0.1849958 -0.6017086 0.0679788 0.0348394 0.0637654 -0.0299893 -0.2869218 0.0507003 -0.2696285 0.0532115 -0.0554869 0.0969751 -0.2636464 0.095866 -0.569602 -0.3342935 -0.2818008 0.0625707 -0.3637206 -0.6340667 0.103727 0.0745799 0.1029508 -0.078507 -0.4167407 0.0774116 -0.3041436 0.1003744 -0.0853633 0.1185608 -0.4124314 0.1182091 -0.5579855 -0.5645858 0.5274333 -0.0462164 0.6098892 -1.0590939 0.0047807 -0.0515646 0.0113992 -0.3821171 0.2442576 -0.166404 -0.046629 0.0699737 0.1373995 -0.0013738 -0.0872553 -0.0041723 0.0294922 0.2853141 -0.019964 -0.1392868 -0.0267258 -0.0255906 0.0122069 -0.0772255 0.0343366 -0.097731 -0.0847075 0.6364249 -0.0513253 0.2362017 0.6409706 -0.0770743 -0.0021274 -0.1350913 -0.0975406 -0.4310727 -0.1347033 0.0488887 -0.1424516 -0.3196696 0.0455212 0.0208097 0.0573788 -0.13075 0.2211706 -0.0789117 0.4924771 -0.0533609 -0.0299137 -0.1715626 0.3678127 -0.1429515 0.7901325 -0.2521254 0.0304482 -0.0992178 0.0043949 -0.0817331 0.0340518 -0.1013151 0.0255743 -0.149614 0.4651578 -0.5383679 0.0229195 -0.6835335 0.8273011 -0.0122879 0.0339779 -0.0238464 0.1366142 0.6405754 0.4626507 -0.1245184 0.4176189 1.0126314 -0.1695054 -0.0907622 -0.1860156 -0.0071733 -0.1335563 -0.1837476 0.0217587 0.1526881 -0.4427306 0.0191882 -0.0179557 0.0598569 -0.143875 0.5062925 -0.1289991 0.5150211 -0.1287968 -0.0108844 -0.2089401 0.6490633 -0.2080727 0.8021951 -0.0632046 0.0156254 -0.1194115 0.0047586 -0.0835689 0.0067106 -0.0866509 -0.0028665 -0.1181424 -0.0768911 0.0280296 -0.113317 0.0302043 -0.1121187 0.0220896 -0.1286253 0.0217093 -0.1783486 0.0775349 0.0424956 -0.0009134 0.0655962 0.027396 0.0032767 -0.0000948 0.0118188 0.1472006 0.0950074 -0.0125002 0.0389674 -0.0140964 0.1337193 0.0291728 0.0628645 0.0190537 0.0178612 0.0293719 -0.0019848 0.0168996 -0.0078966 0.0949705 0.0102753 0.0153882 0.0138481 0.1766774 0.0565255 -0.0006077 0.02872 -0.0091945 0.152795 0.0323506 0.0437386 0.0320579 -0.0063166 -0.0322668 0.0057398 0.0027106 0.0086279 0.1623239 0.0174458 -0.0065109 0.0145077 0.0952015 0.3100143 -0.1494243 0.0305449 -0.138767 0.3524219 0.0164323 0.0230914 0.0206838 0.3523179 unknown
polarizability: 222.2176438|5.9871363|153.5265615|9.8400448|-26.2694298|137.572678 unknown
InChI: InChI=1S/C12H6Cl4O/c13-6-1-2-10(15)8(3-6)9-4-7(14)5-11(17)12(9)16/h1-5,17H
charge 0 multiplicity 1
23 atoms
Cl 0.520001 -2.707275 0.241173
Cl -0.645391 -0.429633 2.854773
Cl 3.429523 2.936221 -0.722209
Cl -4.176856 0.759992 -2.375073
O  3.501013 -2.195653 -0.103488
C  0.527059 0.108065 -0.040504
C  -0.96163 0.10514 0.112447
C  1.303112 -1.070512 0.008389
C  1.193422 1.339318 -0.275085
C  -1.617328 -0.130105 1.346723
C  -1.769538 0.385288 -1.021485
C  2.713377 -1.051432 -0.147218
C  2.592647 1.347823 -0.43075
C  3.369125 0.181461 -0.367941
C  -3.170365 0.405249 -0.900712
C  -3.021097 -0.110682 1.462864
C  -3.81474 0.156854 0.326029
H  0.618865 2.268126 -0.312346
H  -1.291899 0.570308 -1.987868
H  4.45471 0.191558 -0.487367
H  -3.492849 -0.29452 2.431984
H  -4.905223 0.174904 0.40141
H  2.936863 -2.998392 0.060756
