program: Gaussian 09
title: 000119096
version: EM64L-G09RevD.01
frameworkgroup: C1[X(C16H20O5)]
method: RPBEPBE
basis: SDD
operation: Freq
keyword: #pfreq=noraman
keyword: PBEPBE/SDD
title: #p freq=noraman PBEPBE/SDD
converged: YES YES NO NO
title: Mulliken charges:
elementType: O O O O O C C C C C C C C C C C C C C C C H H H H H H H H H H H H H H H H H H H H
charge: -0.263902 -0.209073 -0.229720 -0.434200 -0.242160 -0.018802 -0.430184 -0.400770 -0.326117 -0.512961 -0.734474 0.217086 0.165876 -0.773176 0.216693 0.149947 -0.370648 -0.322138 -0.218289 -0.218151 0.102219 0.203847 0.234295 0.215972 0.201162 0.227915 0.235588 0.240403 0.237072 0.241794 0.206418 0.258288 0.212972 0.256805 0.240320 0.232049 0.267156 0.275917 0.240571 0.239594 0.384806
chargesum: 0.00000
title: Mulliken charges with hydrogens summed into heavy atoms:
elementType: O O O O O C C C C C C C C C C C C C C C C
charge: -0.263902 -0.209073 -0.229720 -0.049394 -0.242160 0.185045 0.020084 0.028307 0.149874 -0.034096 -0.056796 0.217086 0.165876 -0.044002 0.216693 0.149947 -0.103492 -0.046221 0.022283 0.021443 0.102219
polarizability: 2.39668251e+02 -1.06378290e+01 1.91198643e+02 -2.81785168e+01 -6.95948774e+00 1.35130041e+02
1716.lowfreq: -2.3773 -0.0002 0.0005 0.0011 5.2312 8.3044 20.9467 22.6423 29.2133
frequency: 19.0189 22.2668 29.0100 36.8450 40.7259 67.2557 76.0487 81.6860 92.2847 103.0197 111.6718 127.3740 141.6226 176.4747 192.1210 211.5262 233.3896 250.8746 260.0865 283.0944 291.5344 330.9066 357.4060 389.9598 407.1522 441.0354 463.3476 474.8635 516.8547 524.8184 553.7425 588.0993 592.1942 598.5162 651.5430 676.8527 705.7658 736.2697 746.0607 770.6011 780.1224 785.6848 791.0549 822.1083 827.3368 895.9723 908.7714 910.9767 948.3883 960.9876 977.1564 989.4400 1000.6714 1002.7515 1005.8690 1012.5227 1034.0194 1071.0153 1074.6709 1107.6359 1111.7979 1144.8429 1150.4831 1162.9208 1173.0770 1175.8057 1178.6092 1209.7917 1237.8857 1260.9522 1269.3680 1278.9884 1282.7537 1314.8659 1316.9328 1333.7317 1356.2803 1363.8661 1369.3443 1378.0653 1382.8750 1399.9419 1429.9874 1431.6574 1443.3082 1457.0915 1464.0390 1471.6544 1477.3192 1479.7869 1488.0919 1496.7542 1579.0706 1603.7190 1619.0394 1637.3775 1641.6393 2952.3772 2962.0420 2979.8235 2980.1803 2989.6667 2992.2872 3006.7493 3010.9198 3038.2511 3048.2570 3066.1677 3066.8397 3071.9022 3084.5687 3120.2105 3139.8816 3154.6199 3168.5610 3182.1725 3527.8852
redmass: 5.8629 6.2739 4.0123 6.0941 4.6201 4.0021 3.3420 4.1644 1.4440 5.3009 1.7020 4.5270 1.7874 4.1410 6.1004 4.9769 2.0409 3.4071 3.1342 2.2416 2.8505 5.8219 5.6078 5.6304 3.2222 3.0376 2.4758 2.5849 4.5329 2.3112 4.5657 3.6116 1.4078 3.5415 6.0518 4.8141 3.8327 1.5749 3.1901 2.2293 2.4791 1.5538 1.9598 3.0249 4.6357 2.2474 1.5526 2.2781 1.9656 1.6343 1.4199 2.0412 3.4062 2.1187 1.4277 1.4186 3.2260 3.4090 2.9526 2.1325 1.8908 1.7352 2.1442 1.7511 1.7369 1.9202 1.0696 1.1793 2.7692 1.3151 1.1849 1.3818 1.2987 2.4023 1.5162 1.5621 1.3550 1.5638 1.2417 1.6168 8.0745 1.2204 2.2131 1.0927 1.0660 1.0574 1.0851 1.0635 1.5722 1.4904 1.0666 1.0494 7.2289 6.3000 11.7868 7.6939 8.7599 1.0641 1.0802 1.0378 1.0382 1.0639 1.0611 1.0569 1.0922 1.0980 1.1017 1.0951 1.0990 1.1061 1.1004 1.1004 1.0864 1.0913 1.0967 1.0978 1.0641
irintensity: 2.2417 0.2386 2.8348 1.2837 0.8290 0.1183 2.2062 1.5880 1.3151 0.4330 0.1987 2.8807 1.1049 7.6176 1.3855 0.1448 2.4548 0.4407 1.4322 7.3559 0.7909 3.7716 5.1352 8.7927 5.5017 1.6833 6.4931 1.8997 14.6773 8.8991 3.6178 8.8622 86.1976 44.1517 13.2834 8.2300 103.6614 5.6350 3.8384 14.5797 23.5126 15.3176 29.0582 2.2101 4.2463 12.4419 8.2520 4.9183 15.5510 1.8173 9.6065 0.9500 160.5912 45.3624 10.3727 15.3217 85.7759 157.8898 68.1917 12.1909 59.6352 0.3395 0.0528 69.7922 28.5144 45.9921 0.1065 1.9797 229.4863 73.7579 1.1221 34.2318 26.7089 65.9605 25.2615 3.5991 6.9988 11.5840 62.2459 0.8273 9.5487 24.4686 8.1991 23.9394 19.2349 18.3749 0.7502 3.1684 51.5420 2.8354 1.3950 13.5951 31.1282 17.6914 165.6934 126.8105 240.0684 12.2626 14.8387 29.4285 4.3686 22.3889 35.0676 20.7230 6.5735 23.9604 26.9854 15.4121 54.7289 29.7717 51.5094 15.2220 2.1012 8.7432 11.5401 10.1933 37.7606
temp: 298.150 k
press: 1.00000 atm
elementType: 8 8 8 8 8 6 6 6 6 6 6 6 6 6 6 6 6 6 6 6 6 1 1 1 1 1 1 1 1 1 1 1 1 1 1 1 1 1 1 1 1
symmnumber: 1
zpe: 863692.8 jmol-1
zpe.correction: 0.328963 hartree
zpe.thermalcorrener: 0.351344 hartree
zpe.thermalcorrenthalpy: 0.352288 hartree
zpe.thermalcorrgfe: 0.273727 hartree
zpe.sumelectzpe: -996.252281 hartree
zpe.sumelectthermal: -996.229900 hartree
zpe.sumelectthermalent: -996.228956 hartree
zpe.sumelectthermalfe: -996.307517 hartree
dipole: 1.5137 3.6003 -4.4143
dipole: 5.8940
quadrupole: -106.3159 -119.6565 -130.9746
quadrupole: -14.4163 2.1590 7.8517
quadrupole: 12.6664 -0.6742 -11.9923 -14.4163 2.1590 7.8517
hfenergy: -996.5812438 hartree
pointgroup: C01 [X(C16H20O5)]
dipole: 0.6230557 0.6768131 -2.1285826 debye
polarizability: 238.4744853|-21.8682289|180.5710083|-22.9452536|-23.335268|146.9514416 unknown
InChI: InChI=1S/C16H20O5/c1-3-12(9-8-11(2)17)10-21-16(20)14-7-5-4-6-13(14)15(18)19/h4-7,12,18H,3,8-10H2,1-2H3
charge 0 multiplicity 1
41 atoms
O  0.318531 -0.616667 0.187304
O  -6.174279 -1.068647 0.835322
O  1.170832 -1.49036 2.177113
O  2.774821 2.413976 -1.241891
O  1.63717 1.853681 0.699401
C  -2.044926 -0.212217 -0.308442
C  -3.475398 -0.292614 0.292188
C  -1.728442 1.136233 -1.017403
C  -1.039791 -0.543441 0.804243
C  -4.591052 -0.07399 -0.745866
C  -1.804591 2.392585 -0.119166
C  -5.992221 -0.433761 -0.237126
C  1.346057 -1.026102 1.026012
C  -7.163312 0.024896 -1.100996
C  2.680257 -0.944423 0.337083
C  3.153254 0.221892 -0.332854
C  3.481428 -2.110101 0.350997
C  4.392073 0.178121 -1.022395
C  4.718572 -2.141587 -0.328457
C  5.168128 -0.999109 -1.029146
C  2.430365 1.52122 -0.212181
H  -1.954912 -1.012219 -1.074743
H  -3.629344 -1.28407 0.759505
H  -3.592022 0.443903 1.110904
H  -2.422421 1.252247 -1.873391
H  -0.713238 1.063893 -1.450582
H  -1.261033 -1.515714 1.281524
H  -1.006178 0.23202 1.591301
H  -4.404299 -0.698942 -1.647287
H  -4.612698 0.970314 -1.116694
H  -1.644356 3.305536 -0.722386
H  -1.024187 2.376197 0.661819
H  -2.789632 2.492713 0.373965
H  -8.075408 -0.533611 -0.838476
H  -7.349932 1.101989 -0.920038
H  -6.943224 -0.089566 -2.177886
H  3.120264 -2.990063 0.892497
H  4.740352 1.080224 -1.532148
H  5.324646 -3.053545 -0.313412
H  6.123789 -1.01997 -1.563069
H  2.302957 3.275478 -1.083445
