program: Gaussian 09
title: 000000550
version: EM64L-G09RevD.01
frameworkgroup: C1[X(C8H8O7)]
method: RPBEPBE
basis: SDD
operation: Freq
keyword: #p
keyword: freq=noraman
keyword: PBEPBE/SDD
title: #p freq=noraman PBEPBE/SDD
converged: YES YES NO NO
title: Mulliken charges:
elementType: O O O O O O O C C C C C C C C H H H H H H H H
charge: -0.421353 -0.404900 -0.202807 -0.234109 -0.158202 -0.375749 -0.214757 -0.252243 -0.520566 -0.093526 0.144114 0.210808 -0.284754 0.066577 0.118723 0.301864 0.271190 0.297855 0.293211 0.296434 0.389907 0.385455 0.386828
chargesum: 0.00000
title: Mulliken charges with hydrogens summed into heavy atoms:
elementType: O O O O O O O C C C C C C C C
charge: -0.031445 -0.019446 -0.202807 -0.234109 -0.158202 0.011079 -0.214757 0.049621 0.048478 0.199684 0.144114 0.210808 0.011680 0.066577 0.118723
polarizability: 1.44334122e+02 4.77923703e+00 9.93481514e+01 9.91638359e-01 -1.17084849e+01 8.52141258e+01
1716.lowfreq: -8.2894 -0.0007 -0.0005 0.0005 2.8441 9.0066 22.1343 24.5943 30.4937
frequency: 22.0820 24.4769 30.4841 42.8581 61.2570 76.5013 96.8827 137.3179 147.1032 185.2417 244.7589 260.3112 306.6495 343.8757 383.4435 418.6971 447.7921 471.5469 512.7749 521.3031 565.7685 590.4391 613.6885 627.4224 643.6006 653.3409 685.5746 760.2764 811.5919 854.3761 889.5915 906.2777 939.0948 1007.5284 1017.5607 1024.5760 1046.9884 1076.5334 1102.8555 1139.6228 1191.8516 1221.2901 1257.1244 1264.7971 1285.6464 1296.6884 1322.6712 1356.4083 1366.4707 1440.4500 1586.5382 1621.3477 1656.4063 1663.1067 1666.3364 3011.0898 3015.4122 3082.3106 3112.3431 3158.6552 3508.0367 3514.5559 3523.0381
redmass: 10.7151 12.6566 8.6544 8.1668 12.3278 6.6532 5.3706 3.8994 4.1924 4.8252 7.8982 6.9734 8.0899 2.6926 6.5942 4.1581 4.1975 3.7785 2.4487 5.6427 3.3853 1.8973 2.4544 3.1302 1.3351 1.5126 3.5693 5.2424 6.5440 5.0965 2.0294 2.7913 4.3510 1.2248 3.0784 3.1379 2.5450 2.3575 2.1400 1.8889 1.3514 1.2981 1.3570 1.5525 1.5126 1.5240 2.4130 1.8891 1.9909 1.0894 11.9095 10.0617 6.4096 9.0791 8.6769 1.0702 1.0734 1.0994 1.0911 1.0923 1.0642 1.0641 1.0643
irintensity: 0.4578 0.9040 2.1235 2.4701 1.9830 0.8268 0.4196 2.0702 0.7457 0.4004 3.3098 0.6498 9.4262 5.0568 6.2228 8.1849 1.6939 45.3408 58.7933 37.9681 73.0085 52.8689 42.0580 59.8163 177.5855 152.8037 21.4996 0.8852 6.9176 15.4821 18.5423 1.8603 22.3346 95.8625 306.6113 177.3462 236.6442 169.9692 11.7453 23.8605 12.7575 23.9763 12.4485 57.7105 58.9385 38.6235 7.5010 33.5162 15.7792 30.6463 170.1110 165.7658 86.7915 253.7222 185.4005 1.8888 13.4766 2.3107 0.0837 5.1172 41.3667 32.1373 36.8418
temp: 298.150 k
press: 1.00000 atm
elementType: 8 8 8 8 8 8 8 6 6 6 6 6 6 6 6 1 1 1 1 1 1 1 1
symmnumber: 1
zpe: 411603.0 jmol-1
zpe.correction: 0.156771 hartree
zpe.thermalcorrener: 0.172399 hartree
zpe.thermalcorrenthalpy: 0.173344 hartree
zpe.thermalcorrgfe: 0.109789 hartree
zpe.sumelectzpe: -835.083989 hartree
zpe.sumelectthermal: -835.068361 hartree
zpe.sumelectthermalent: -835.067417 hartree
zpe.sumelectthermalfe: -835.130971 hartree
dipole: -2.8314 2.1516 -0.4560
dipole: 3.5853
quadrupole: -65.3763 -85.9551 -94.2039
quadrupole: 6.2583 -3.2184 10.3702
quadrupole: 16.4688 -4.1100 -12.3588 6.2583 -3.2184 10.3702
hfenergy: -835.2407605 hartree
pointgroup: C01 [X(C8H8O7)]
dipole: -1.181137 0.6888967 -0.3463959 debye
dipolederiv: -1.2270416 -0.0380079 -0.3557622 -0.1219772 -0.3427105 -0.080327 -0.3711394 -0.0721819 -0.5467034 -0.4583803 0.225373 0.0687822 0.3814944 -0.9959488 -0.4453783 0.1187368 -0.4194305 -0.5413666 -0.6603285 -0.0847635 -0.1219935 0.1281903 -0.8590941 0.2401715 -0.2239122 0.1949896 -0.438952 -0.4879904 0.0930945 0.2483226 0.0089089 -0.670541 0.1308163 0.2729394 -0.1243903 -0.7509686 -0.6514757 -0.0389804 -0.0189328 0.1285257 -0.3352482 0.1513704 -0.436685 0.0993744 -0.6264272 -1.2152858 0.0336279 -0.4313715 -0.0206101 -0.3598583 -0.0809371 -0.3620316 -0.0619053 -0.4186644 -0.746804 -0.1126718 0.0840117 0.0072134 -0.3842349 0.2069855 -0.2253323 0.142587 -0.7557078 -0.0488887 -0.0294532 -0.0411361 0.0046302 -0.2510444 0.05794 0.1371273 0.166364 0.0873199 -0.1289047 -0.283216 0.0978034 -0.1962678 -0.1820794 0.0742969 -0.043096 0.1443053 0.0373873 0.6260013 0.0473953 0.0940029 0.1835138 -0.0813615 -0.085624 -0.0855802 -0.1395398 0.0458169 1.4241345 0.233922 0.5036165 0.1627475 1.2008407 -0.2725752 0.4974375 -0.306712 0.5213039 0.5060354 -0.0820636 -0.4772467 -0.2838752 1.47014 0.1632245 -0.4981589 0.3098393 0.9864884 -1.1569256 -0.0775857 -0.1283741 -0.2713277 -0.1346834 -0.1042594 0.0531619 -0.0666272 -0.055624 1.4188359 0.1390404 0.0720436 -0.0108464 0.2992916 -0.1617436 0.5384549 -0.0900444 0.6032456 1.4155865 0.0748674 0.3406308 0.013269 0.3196277 -0.2112343 0.545235 -0.1691387 0.8999203 0.0503492 -0.004076 0.0156348 -0.0358676 0.1553766 0.0226553 -0.0278169 -0.0473413 -0.0060599 0.1498188 0.0354813 -0.0284323 -0.0015497 0.0471163 0.0008784 -0.0048523 -0.0189493 -0.0431727 -0.040829 0.0362961 -0.0283688 0.0843276 0.1122507 0.0152139 -0.0248916 0.0239297 0.1039422 0.0788246 -0.0021192 -0.0177724 0.0205421 0.1315109 0.0616766 -0.0130014 0.0565127 0.0409426 0.1484145 -0.0142523 -0.0261177 0.0069134 0.1420917 0.0642449 -0.0570312 0.0555195 0.0485471 0.3453958 -0.0109843 -0.0100835 -0.0554513 0.1281645 0.0668838 0.0156286 0.0982787 0.3599643 0.3408449 -0.090481 0.0878436 -0.0667738 0.2446802 0.0825174 0.0830219 0.1163042 0.2473331 0.3186128 -0.0504429 0.0728995 -0.0657292 0.3457135 0.1032034 0.1117856 0.1082565 0.2014349 unknown
polarizability: 142.5303399|10.420844|97.3183679|3.8536162|-12.7185849|89.0476916 unknown
InChI: InChI=1S/C8H8O7/c9-5(8(14)15)2-1-4(7(12)13)3-6(10)11/h1-2,4,10,12,14H,3H2
charge 0 multiplicity 1
23 atoms
O  -3.538775 -1.883751 -0.724464
O  -2.314053 2.940054 0.530979
O  -1.880347 -2.972731 0.483259
O  -1.233861 2.056341 -1.325847
O  2.431351 -0.747998 1.679945
O  4.644992 0.283686 0.464018
O  3.374603 0.822284 -1.407501
C  -1.521038 -0.636642 -0.289611
C  -2.35172 0.551932 0.2912
C  -0.153469 -0.716763 0.351497
C  -2.281081 -1.949959 -0.107682
C  -1.884388 1.881949 -0.273073
C  0.974841 -0.172248 -0.186983
C  2.268683 -0.250876 0.533568
C  3.462569 0.343212 -0.253148
H  -1.425682 -0.453906 -1.377632
H  -2.307705 0.58543 1.3933
H  -3.414506 0.427105 0.0093
H  -0.084139 -1.232931 1.32019
H  0.968761 0.334222 -1.158008
H  -4.006368 -2.756455 -0.622741
H  -2.030748 3.804342 0.125027
H  5.385482 0.669403 -0.079894
