program: Gaussian 09
title: 000119033
version: EM64L-G09RevD.01
frameworkgroup: C1[X(C14H17NO6)]
method: RPBEPBE
basis: SDD
operation: Freq
keyword: #p
keyword: freq=noraman
keyword: PBEPBE/SDD
title: #p freq=noraman PBEPBE/SDD
converged: NO YES NO NO
title: Mulliken charges:
elementType: O O O O O O N C C C C C C C C C C C C C C H H H H H H H H H H H H H H H H H
charge: -0.288987 -0.253682 -0.453546 -0.429987 -0.448282 -0.430468 0.009930 -0.151131 -0.202559 -0.095851 -0.065052 0.015028 -0.354685 -0.141240 0.387408 -0.171128 -0.410671 -0.324569 -0.215980 -0.224899 -0.234124 0.206059 0.272231 0.248616 0.215824 0.217675 0.206759 0.232198 0.365143 0.335742 0.368894 0.248061 0.348939 0.235301 0.280856 0.233135 0.234624 0.234416
chargesum: 0.00000
title: Mulliken charges with hydrogens summed into heavy atoms:
elementType: O O O O O O N C C C C C C C C C C C C C C
charge: -0.288987 -0.253682 -0.088403 -0.094245 -0.079387 -0.081529 0.009930 0.054928 0.069672 0.152765 0.150772 0.232702 0.084273 0.106821 0.387408 -0.171128 -0.175370 -0.043713 0.017156 0.009725 0.000292
polarizability: 1.79965464e+02 -1.66398392e+00 1.66217942e+02 -7.57539580e+00 -1.28837337e+00 1.64508576e+02
1716.lowfreq: -14.5377 -2.7263 -0.0006 -0.0004 0.0002 3.4119 6.5467 26.1285 30.0208
frequency: 5.7834 25.6810 29.7709 44.8853 63.7061 81.6939 91.6523 97.1864 123.2147 150.5716 175.2434 185.9099 217.3470 233.6210 249.9494 276.3334 288.5102 321.4810 330.8142 360.5187 376.4949 392.4507 398.7529 401.0528 405.7409 419.6286 425.6707 446.3030 467.5925 515.7952 533.2414 559.0199 584.0699 601.7549 613.7159 619.2641 659.2092 703.2568 764.8977 812.3060 840.2439 856.1670 908.2949 923.5766 928.0364 931.6683 961.9036 971.9416 982.3166 984.9648 991.7186 1003.6047 1006.6105 1023.4942 1027.0425 1039.6295 1051.7198 1075.0346 1082.3931 1086.4414 1099.0620 1117.5980 1175.6265 1179.3904 1181.8937 1188.9559 1194.5843 1197.5572 1220.2553 1244.5332 1256.0406 1268.6524 1281.6546 1288.7652 1306.9633 1326.2534 1332.1604 1336.2970 1339.5164 1348.5651 1364.1714 1375.6258 1380.5056 1387.4238 1406.7955 1443.6254 1459.7597 1481.7385 1596.6904 1611.0295 2205.3480 2907.5331 2919.1637 2944.1932 2976.3383 2990.5266 3006.3605 3067.6682 3099.0064 3120.5650 3133.7251 3145.1917 3156.4018 3169.6175 3524.5704 3544.3827 3552.5466 3552.8148
redmass: 5.3700 6.1501 4.3511 7.2975 6.8241 4.6348 7.4907 6.7897 7.3004 4.1428 3.8087 4.6208 4.5243 4.2499 5.9593 4.5036 5.3348 4.5964 1.2422 3.6533 3.3289 1.5900 5.4477 2.8720 3.6773 2.7939 1.7859 1.1801 3.0649 4.8738 4.9281 3.6683 3.7110 3.7946 6.3240 5.6373 5.8782 1.7967 1.9081 4.5068 2.6977 1.2606 6.3467 6.9375 1.5602 5.2486 5.7801 3.9270 1.4815 3.6547 4.3147 1.3569 3.7339 2.8735 2.2275 3.5915 2.7155 4.1911 2.1995 1.7096 3.6387 2.3008 1.0591 1.3155 1.3158 1.2430 1.6869 1.4504 1.1670 1.2037 1.2732 1.1804 1.4701 1.2144 1.2920 1.3424 1.2394 1.2645 1.4121 1.3085 1.1977 1.5455 1.3223 7.4237 1.7015 2.1600 1.0829 2.2407 6.1113 5.9719 12.5981 1.0819 1.0822 1.0834 1.0683 1.0826 1.0848 1.0859 1.0957 1.0882 1.0869 1.0914 1.0963 1.1015 1.0659 1.0656 1.0655 1.0656
irintensity: 0.2138 0.3895 0.3358 1.1675 0.5501 6.0666 1.9173 3.7031 1.6353 2.7638 1.8502 5.6985 13.0999 4.2618 10.3480 5.8262 4.5436 3.6240 74.4426 29.7545 20.2791 80.1558 16.7778 3.1544 30.5815 29.3843 124.5229 172.7496 62.5774 21.2166 13.1031 19.8549 10.4059 23.7725 2.0345 12.6445 10.0609 60.5225 55.1142 10.5669 27.4807 0.2224 65.7616 162.9230 4.1207 308.3112 133.0847 2.7364 0.1684 29.7013 5.4226 0.5079 29.1181 17.3672 3.8983 137.7688 57.2117 2.7891 49.1056 16.1047 21.7427 7.3396 0.2840 21.5652 9.2715 7.7129 14.0356 34.9651 17.0964 16.5279 4.7208 17.1974 10.4778 34.7491 8.3657 11.8974 15.1418 2.5209 7.1040 7.0538 22.1461 2.1683 18.1951 0.3324 20.3409 13.8189 5.1426 7.0039 0.6343 0.0233 0.9295 15.8696 40.4656 38.2149 50.4820 12.2836 27.8589 14.3856 15.6113 5.7184 1.0968 13.9768 16.7425 19.4132 11.1868 20.0472 10.1041 17.2162
temp: 298.150 k
press: 1.00000 atm
elementType: 8 8 8 8 8 8 7 6 6 6 6 6 6 6 6 6 6 6 6 6 6 1 1 1 1 1 1 1 1 1 1 1 1 1 1 1 1 1
symmnumber: 1
zpe: 772420.0 jmol-1
zpe.correction: 0.294199 hartree
zpe.thermalcorrener: 0.315166 hartree
zpe.thermalcorrenthalpy: 0.316110 hartree
zpe.thermalcorrgfe: 0.241393 hartree
zpe.sumelectzpe: -1048.120670 hartree
zpe.sumelectthermal: -1048.099704 hartree
zpe.sumelectthermalent: -1048.098759 hartree
zpe.sumelectthermalfe: -1048.173477 hartree
dipole: -2.1656 -0.7301 -5.8899
dipole: 6.3178
quadrupole: -125.4974 -127.2619 -130.3057
quadrupole: 6.0728 -14.1542 4.5047
quadrupole: 2.1910 0.4264 -2.6174 6.0728 -14.1542 4.5047
hfenergy: -1048.4148696 hartree
pointgroup: C01 [X(C14H17N1O6)]
dipole: 0.7004238 1.5040785 -1.8507758 debye
polarizability: 180.8990995|-3.7340918|163.7763177|5.4181362|1.9247448|166.0165648 unknown
InChI: InChI=1S/C14H17NO6/c15-6-9(8-4-2-1-3-5-8)20-14-13(19)12(18)11(17)10(7-16)21-14/h1-5,9-14,16-19H,7H2
charge 0 multiplicity 1
38 atoms
O  1.428503 -0.907597 0.051747
O  -0.370892 -0.376435 1.454897
O  3.403626 2.555055 1.311996
O  4.504192 1.054325 -0.970023
O  0.551781 2.346552 1.658607
O  2.276177 -2.587692 -2.099612
N  -2.814671 -2.341791 2.759448
C  2.591832 1.68985 0.453968
C  3.414965 0.524879 -0.122477
C  1.414888 1.215711 1.326032
C  2.490072 -0.452901 -0.878933
C  0.567886 0.199619 0.546075
C  3.192626 -1.730532 -1.348438
C  -1.436637 -1.177796 0.790432
C  -2.341345 -0.325803 -0.102728
C  -2.187733 -1.811874 1.895328
C  -2.746028 -0.810956 -1.368278
C  -2.781834 0.94548 0.343052
C  -3.603663 -0.036636 -2.182863
C  -3.63384 1.717929 -0.474212
C  -4.05063 1.227541 -1.735288
H  2.175593 2.282221 -0.39692
H  3.945024 -0.002689 0.689563
H  1.815459 0.725274 2.236865
H  2.018649 0.057036 -1.752718
H  0.067206 0.682658 -0.323436
H  3.610489 -2.257917 -0.465276
H  4.01314 -1.482101 -2.039687
H  4.252763 2.749753 0.836625
H  4.11092 1.458326 -1.788017
H  1.119682 3.027868 2.103371
H  -0.965146 -1.982157 0.189822
H  1.510227 -2.79037 -1.502943
H  -2.399909 -1.79212 -1.716901
H  -2.43687 1.327117 1.310426
H  -3.917854 -0.417134 -3.160774
H  -3.972101 2.701062 -0.129644
H  -4.716045 1.828143 -2.365286
