program: Gaussian 09
title: 000118945
version: EM64L-G09RevD.01
frameworkgroup: C1[X(C11H22O2)]
method: RPBEPBE
basis: SDD
operation: Freq
keyword: #pfreq=noraman
keyword: PBEPBE/SDD
title: #p freq=noraman PBEPBE/SDD
converged: YES YES NO NO
title: Mulliken charges:
elementType: O O C C C C C C C C C C C H H H H H H H H H H H H H H H H H H H H H H
charge: -0.223419 -0.233773 -0.392059 -0.375468 -0.381554 -0.022452 -0.378706 -0.381186 -0.388769 -0.715141 -0.715765 -0.311756 0.010701 0.189000 0.203804 0.192572 0.194149 0.189094 0.188594 0.191979 0.195962 0.195465 0.196367 0.196330 0.215660 0.215851 0.211934 0.205778 0.212416 0.203264 0.221649 0.210737 0.235093 0.235130 0.208518
chargesum: 0.00000
title: Mulliken charges with hydrogens summed into heavy atoms:
elementType: O O C C C C C C C C C C C
charge: -0.223419 -0.233773 0.000745 0.002221 0.005167 0.169527 0.012721 0.011511 0.042742 -0.085013 -0.080115 0.158467 0.219219
polarizability: 1.70152126e+02 -8.47655482e-01 1.13469970e+02 9.25454999e-01 -2.67234090e+00 9.89770230e+01
1716.lowfreq: -4.4269 -0.0006 0.0009 0.0011 5.1908 14.6942 28.8095 32.2180 38.4197
frequency: 22.1687 29.9686 36.8792 50.5210 72.4835 91.5456 96.0134 117.1597 139.0227 150.0896 162.0225 188.8813 212.1261 238.4390 268.0583 320.6763 335.3436 363.5048 405.9519 414.5434 472.7035 492.0772 723.9411 732.1799 735.4993 761.3621 804.6360 821.5957 855.0027 887.5197 916.4851 938.3396 952.0603 960.2426 975.7128 1003.1062 1014.4376 1035.4501 1057.6935 1069.3393 1080.4456 1098.4882 1101.1946 1140.0788 1150.2037 1177.9232 1182.6964 1216.1384 1218.5195 1252.9155 1256.8916 1275.3410 1283.7711 1289.3374 1292.3815 1296.4750 1316.5789 1332.1484 1336.5627 1343.4976 1354.7614 1358.5938 1370.3052 1377.3518 1393.5007 1455.7732 1461.9319 1465.1126 1468.0763 1469.4443 1472.5200 1473.9301 1481.5057 1483.4311 1488.7744 1489.7224 1622.2359 2945.1065 2952.1601 2952.9682 2954.8264 2960.3102 2964.6024 2966.3368 2969.9010 2987.5072 2990.9076 2994.1588 3003.6716 3003.9190 3022.8165 3034.8309 3039.3704 3048.5550 3056.7675 3064.0329 3066.6322 3074.2734 3078.5593
redmass: 5.4717 3.6014 4.5186 2.2192 2.5620 2.1026 3.7034 2.1109 1.9877 1.9889 5.0521 3.8010 1.0971 1.1327 3.3146 3.1956 2.4652 2.7137 2.5882 2.3408 2.7347 3.0600 1.0678 7.2098 1.1040 1.1511 1.6358 1.6727 6.7870 1.2677 1.1739 1.8212 1.3905 1.6077 1.3779 4.7265 3.0383 1.2436 3.4897 2.7194 2.1611 2.7275 7.9122 2.5256 1.4329 1.7504 1.8370 1.3988 1.3292 1.3147 1.2564 1.1433 1.0739 1.2466 1.1305 1.1160 1.3543 1.4156 1.2580 1.3196 1.5713 1.5967 1.5038 1.2186 1.2141 1.0727 1.0720 1.0784 1.0784 1.0480 1.0620 1.0838 1.0793 1.0725 1.0679 1.0796 8.5721 1.0615 1.0591 1.0760 1.0622 1.0613 1.0364 1.0588 1.0365 1.0957 1.0599 1.0981 1.1012 1.0575 1.1039 1.0914 1.1041 1.1044 1.0993 1.0992 1.0991 1.0987 1.1082
irintensity: 1.0993 0.3719 0.3597 0.0453 0.1546 0.1085 0.7413 0.1683 0.0149 0.0613 2.3377 0.5045 0.1563 0.1523 5.8510 1.5268 29.0346 1.8880 2.9764 0.6875 1.9557 0.3244 12.5683 3.3614 0.6607 2.9216 0.6332 1.4550 14.6224 1.7794 4.0308 4.0957 0.6404 3.1289 0.1615 0.0209 0.1384 1.5656 17.9000 1.4603 6.6968 5.8453 354.8740 0.7460 1.5419 11.4603 3.0331 4.6209 6.8647 0.8517 0.1440 0.7158 0.0959 0.5129 0.2858 0.0837 0.9017 2.1953 14.8363 0.6407 1.3869 0.2394 10.5917 18.6032 15.4185 0.3604 0.0804 0.1519 1.1935 1.2725 3.8006 4.4927 5.2366 2.8507 4.7867 46.1909 295.3397 10.1314 1.4968 10.8126 3.7411 2.8720 26.6825 161.9769 27.9077 2.9970 20.9701 5.9191 6.7772 35.4413 0.8291 63.2282 86.4001 62.1039 8.9687 79.9166 76.2106 57.0278 75.4894
temp: 298.150 k
press: 1.00000 atm
elementType: 8 8 6 6 6 6 6 6 6 6 6 6 6 1 1 1 1 1 1 1 1 1 1 1 1 1 1 1 1 1 1 1 1 1 1
symmnumber: 1
zpe: 815766.8 jmol-1
zpe.correction: 0.310709 hartree
zpe.thermalcorrener: 0.327667 hartree
zpe.thermalcorrenthalpy: 0.328611 hartree
zpe.thermalcorrgfe: 0.263235 hartree
zpe.sumelectzpe: -581.729894 hartree
zpe.sumelectthermal: -581.712936 hartree
zpe.sumelectthermalent: -581.711992 hartree
zpe.sumelectthermalfe: -581.777368 hartree
dipole: -2.3288 1.0452 -0.4876
dipole: 2.5987
quadrupole: -102.4462 -85.7338 -81.3725
quadrupole: 9.9388 -3.2399 1.5411
quadrupole: -12.5954 4.1171 8.4783 9.9388 -3.2399 1.5411
hfenergy: -582.0406034 hartree
pointgroup: C01 [X(C11H22O2)]
dipole: 0.9165527 0.4164358 0.1785051 debye
polarizability: 170.1566957|1.0608695|113.5392006|0.2625446|2.487623|98.9032226 unknown
InChI: InChI=1S/C11H22O2/c1-11(2)8-6-4-3-5-7-9-13-10-12/h10-11H,3-9H2,1-2H3
charge 0 multiplicity 1
35 atoms
O  -4.940705 0.717385 0.253541
O  -6.507807 -0.931402 -0.310057
C  2.63429 0.278236 0.184379
C  3.881625 -0.587157 -0.106145
C  1.306786 -0.471746 -0.069755
C  5.238684 0.08407 0.239172
C  0.056628 0.392175 0.209207
C  -1.271164 -0.355193 -0.04909
C  -2.512647 0.525119 0.228111
C  6.39804 -0.928801 0.082424
C  5.502552 1.343648 -0.621492
C  -3.813741 -0.231956 -0.031976
C  -6.220113 0.222165 0.068142
H  2.665054 0.620406 1.240507
H  2.653327 1.193229 -0.44132
H  1.273403 -1.38295 0.563652
H  1.282035 -0.824572 -1.122205
H  3.798772 -1.53314 0.469714
H  3.888397 -0.876055 -1.179134
H  5.197845 0.398236 1.304809
H  0.080767 0.743378 1.261864
H  0.092127 1.303455 -0.423602
H  -1.307783 -1.264261 0.586626
H  -1.291702 -0.708459 -1.101068
H  -2.483986 1.427624 -0.41237
H  -2.498948 0.875287 1.278168
H  7.368222 -0.474974 0.35865
H  6.47457 -1.274653 -0.966932
H  6.243744 -1.818958 0.720946
H  5.513379 1.08166 -1.697774
H  4.730469 2.11884 -0.468251
H  6.482792 1.792259 -0.374054
H  -3.903324 -0.569066 -1.081215
H  -3.928857 -1.11301 0.625992
H  -6.944632 1.02248 0.311837
