program: Gaussian 09
title: 000000298
version: EM64L-G09RevD.01
frameworkgroup: C1[X(C11H12Cl2N2O5)]
method: RPBEPBE
basis: SDD
operation: Freq
keyword: #p
keyword: freq=noraman
keyword: PBEPBE/SDD
title: #p freq=noraman PBEPBE/SDD
converged: YES YES NO NO
title: Mulliken charges:
elementType: Cl Cl O O O O O N N C C C C C C C C C C C H H H H H H H H H H H H
charge: 0.071949 0.051688 -0.464275 -0.488815 -0.266282 -0.211691 -0.207035 -0.374179 0.025765 -0.118294 -0.177318 0.415133 -0.416159 -0.376162 -0.356136 0.450138 -0.375835 -0.353593 0.373541 -0.741070 0.276119 0.222988 0.243024 0.234090 0.347709 0.269892 0.299277 0.380639 0.285647 0.285693 0.372142 0.321410
chargesum: 0.00000
title: Mulliken charges with hydrogens summed into heavy atoms:
elementType: Cl Cl O O O O O N N C C C C C C C C C C C
charge: 0.071949 0.051688 -0.083635 -0.116673 -0.266282 -0.211691 -0.207035 -0.026470 0.025765 0.157825 0.045670 0.415133 0.060954 -0.106269 -0.056860 0.450138 -0.090188 -0.067900 0.373541 -0.419660
polarizability: 2.67326947e+02 -9.12176093e+00 1.43385937e+02 3.03132369e+00 1.70508926e+01 1.29629153e+02
1716.lowfreq: -5.5801 -3.4246 -0.0023 -0.0016 -0.0013 4.4960 9.3789 20.7995 29.4529
frequency: 8.1681 20.7446 29.4178 45.4945 54.2115 71.3633 94.6205 96.0788 123.0683 139.6667 164.1077 178.9283 214.5629 236.2274 257.7010 278.7146 295.3796 305.4621 315.2452 345.1474 358.3444 409.9549 424.3823 436.7483 484.7499 514.4442 520.9609 608.1807 622.1467 627.0192 660.3678 671.1334 695.4876 706.4787 714.8924 726.8712 739.7879 757.9261 779.2947 829.9738 853.8503 859.0099 883.1320 914.1831 962.2490 980.9236 992.0675 1005.6296 1007.7252 1024.3702 1071.6824 1091.6073 1093.5588 1109.2703 1161.0946 1175.1315 1183.0316 1192.9066 1201.3510 1221.3849 1227.3128 1250.7137 1266.0240 1287.6869 1302.9976 1314.4807 1338.9560 1365.1846 1399.7184 1404.1181 1417.7480 1434.3592 1474.6725 1479.1969 1481.0979 1595.8959 1607.3802 1614.7043 2957.1824 2978.3500 3015.7692 3058.4461 3110.8320 3144.2461 3171.6234 3181.7543 3188.9155 3257.1470 3471.7691 3601.5155
redmass: 14.9552 9.2818 7.1079 9.3792 12.1609 5.7341 5.7997 9.3715 6.8163 9.9326 8.8031 6.8510 8.9762 6.8848 8.5686 5.1589 6.2122 2.4031 1.8079 5.5374 5.3784 2.9062 3.4515 5.3010 7.9426 5.1685 3.7664 6.9315 6.2242 6.5480 6.1665 4.7700 1.5148 2.2566 1.4287 4.7096 3.8530 6.9416 8.0248 3.0680 1.6338 2.3052 1.7794 3.7260 3.7530 2.6482 1.8051 1.6071 2.3279 4.6942 2.6004 3.3223 2.1288 1.3171 1.1760 1.2718 1.1421 1.3892 2.2738 6.1659 1.1901 1.1885 1.1906 1.4829 1.2664 1.3219 1.5952 7.0070 1.4029 7.4235 3.1317 1.4869 1.1654 1.8903 2.2030 7.8427 6.3936 6.7871 1.0839 1.0626 1.0838 1.1022 1.0891 1.0902 1.0888 1.0948 1.0968 1.0684 1.0783 1.0670
irintensity: 0.3287 0.5896 2.2053 2.2932 0.6033 0.3275 4.5642 0.9684 2.2192 0.3609 4.2053 0.2003 1.6423 15.7919 0.6408 11.2520 6.2830 15.6981 154.5545 9.6740 9.5532 0.0336 6.7215 8.8532 2.5389 3.6025 4.6575 34.8992 43.2138 30.0424 20.3362 24.7098 65.9236 20.8905 173.4238 28.2848 15.8278 37.7463 40.3870 17.9208 5.6680 1.1842 43.5524 19.2673 0.6068 1.1360 4.2788 2.2994 5.6059 43.1211 61.7111 13.5473 19.3711 11.3066 15.2645 40.1094 22.2878 4.7301 83.4406 332.6936 18.5647 2.0300 45.2210 14.1708 12.7977 21.2714 6.4703 75.2050 4.3158 0.8720 104.6813 84.8338 31.5056 284.4363 4.4949 2.0344 75.5132 98.4314 27.0417 37.8356 15.6450 26.2928 6.8335 3.8338 1.2822 1.3144 0.1803 464.3403 98.2942 15.9229
temp: 298.150 k
press: 1.00000 atm
elementType: 17 17 8 8 8 8 8 7 7 6 6 6 6 6 6 6 6 6 6 6 1 1 1 1 1 1 1 1 1 1 1 1
symmnumber: 1
zpe: 597818.3 jmol-1
zpe.correction: 0.227697 hartree
zpe.thermalcorrener: 0.247492 hartree
zpe.thermalcorrenthalpy: 0.248436 hartree
zpe.thermalcorrgfe: 0.174824 hartree
zpe.sumelectzpe: -1830.523852 hartree
zpe.sumelectthermal: -1830.504057 hartree
zpe.sumelectthermalent: -1830.503113 hartree
zpe.sumelectthermalfe: -1830.576725 hartree
dipole: 3.5948 6.4692 -0.5542
dipole: 7.4216
quadrupole: -191.1988 -123.9808 -126.9284
quadrupole: 9.2252 3.5134 -0.4683
quadrupole: -43.8295 23.3886 20.4409 9.2252 3.5134 -0.4683
hfenergy: -1830.751549 hartree
pointgroup: C01 [X(C11H12Cl2N2O5)]
dipole: -1.5149028 -2.4012129 -0.6818382 debye
polarizability: 265.4940007|-11.3939467|150.5621571|-15.3313828|-11.4114791|124.2858791 unknown
InChI: InChI=1S/C11H12Cl2N2O5/c12-10(13)11(18)14-8(5-16)9(17)6-1-3-7(4-2-6)15(19)20/h1-4,8-10,14,16-17H,5H2
charge 0 multiplicity 1
32 atoms
Cl -5.687672 0.434531 2.292364
Cl -6.228753 -0.137983 -0.670944
O  -0.805891 1.918364 0.560692
O  -0.963355 -2.585478 -0.114619
O  -3.50955 1.55435 0.316352
O  5.764057 -1.235995 0.309395
O  5.853484 0.768265 -0.775691
N  -2.722828 -0.617887 0.023842
N  5.211616 -0.161481 -0.150054
C  -1.387729 -0.243192 -0.498067
C  -0.515221 0.492501 0.607973
C  0.986517 0.326845 0.41553
C  -0.801064 -1.515937 -1.123761
C  1.648392 -0.8237 0.91942
C  1.734906 1.325514 -0.256508
C  -3.686578 0.297311 0.354158
C  3.034217 -0.991503 0.740291
C  3.122379 1.172737 -0.447983
C  3.751857 0.010554 0.049143
C  -5.02728 -0.337541 0.747813
H  -1.520474 0.507881 -1.302514
H  -0.799595 0.053784 1.588664
H  0.261911 -1.360319 -1.3793
H  -1.368264 -1.772569 -2.04141
H  -2.831024 -1.620043 0.222248
H  1.071383 -1.587909 1.451345
H  1.213951 2.226045 -0.591605
H  -1.804101 2.041368 0.50808
H  3.566998 -1.865173 1.124515
H  3.720674 1.930101 -0.961363
H  -0.594391 -3.436311 -0.455522
H  -4.966172 -1.417732 0.936116
