program: Gaussian 09
title: 000118901
version: EM64L-G09RevD.01
frameworkgroup: C1[X(C9H7N3O2)]
method: RPBEPBE
basis: SDD
operation: Freq
keyword: #pfreq=noraman
keyword: PBEPBE/SDD
title: #p freq=noraman PBEPBE/SDD
converged: YES YES YES YES
title: Mulliken charges:
elementType: O O N N N C C C C C C C C C H H H H H H H
charge: -0.213229 -0.280366 -0.009170 -0.659633 0.023545 0.323967 0.221224 -0.081202 0.227977 -0.323345 -0.373316 -0.249762 -0.198403 -0.354758 0.269531 0.289173 0.211693 0.236496 0.374548 0.316242 0.248788
chargesum: 0.00000
title: Mulliken charges with hydrogens summed into heavy atoms:
elementType: O O N N N C C C C C C C C C
charge: -0.213229 -0.280366 -0.009170 0.031157 0.023545 0.323967 0.221224 -0.081202 0.227977 -0.053814 -0.084143 -0.038069 0.038093 -0.105970
polarizability: 2.20925495e+02 -1.00580402e+01 1.43659965e+02 -1.59257926e-02 -1.49457473e-02 4.80488746e+01
1716.lowfreq: -0.0007 -0.0004 0.0002 4.5994 11.5162 14.7090 64.2941 94.3697 109.9601
frequency: 64.2919 94.3596 109.9599 226.8589 228.8532 269.6809 331.1938 369.7477 405.1048 409.5160 456.8034 480.9740 505.4300 546.1946 573.5037 585.6042 606.8538 647.0617 698.0181 699.8080 750.9845 766.1159 793.7598 812.3116 845.3594 860.1569 877.3752 933.2763 975.7521 993.5392 1028.6969 1059.7642 1108.9002 1128.5132 1156.1557 1201.9744 1239.8202 1244.4887 1278.7601 1324.9315 1345.0772 1390.9303 1413.7681 1428.6922 1456.2516 1508.6233 1556.9178 1581.3238 1604.5195 1610.8565 3128.2979 3132.5464 3172.2422 3175.0744 3194.4202 3321.1866 3646.9213
redmass: 7.0252 8.8577 4.1144 4.6744 7.6883 4.6226 8.8750 4.7814 5.6811 3.1830 2.1668 7.4827 1.8032 5.2931 2.9586 6.6004 7.3686 6.9140 4.8510 6.6238 9.3845 1.6883 1.1354 2.1192 1.9427 3.7060 4.8568 1.3818 1.4119 1.2888 3.0880 2.4598 2.4160 2.2940 1.4269 2.6814 1.7067 2.1027 2.9425 6.6698 3.8570 2.5827 2.1691 3.8201 3.5171 4.0936 2.0403 5.4264 3.0938 4.8480 1.0877 1.0913 1.0987 1.0879 1.0981 1.0608 1.0894
irintensity: 0.6062 1.6570 0.0511 8.4673 3.6489 2.6523 0.4671 4.7583 3.3406 3.1495 40.1822 8.1253 54.9398 5.8419 24.2233 5.0076 0.0297 0.4258 0.6093 0.0287 10.0789 10.8580 166.5047 42.8871 46.1192 2.8767 0.1860 0.3850 1.0135 0.3170 0.3456 10.5055 5.4535 122.6017 24.8384 279.3786 34.8220 35.2762 31.4372 158.3469 43.1476 12.6263 54.0353 5.9173 46.0646 8.4936 9.6771 5.3205 272.2416 180.8305 8.5483 22.5857 21.6243 4.8792 1.5276 92.8598 49.2090
temp: 298.150 k
press: 1.00000 atm
elementType: 8 8 7 7 7 6 6 6 6 6 6 6 6 6 1 1 1 1 1 1 1
symmnumber: 1
zpe: 396909.6 jmol-1
zpe.correction: 0.151175 hartree
zpe.thermalcorrener: 0.161770 hartree
zpe.thermalcorrenthalpy: 0.162714 hartree
zpe.thermalcorrgfe: 0.114640 hartree
zpe.sumelectzpe: -660.820213 hartree
zpe.sumelectthermal: -660.809618 hartree
zpe.sumelectthermalent: -660.808674 hartree
zpe.sumelectthermalfe: -660.856747 hartree
dipole: -5.0283 3.7992 0.0020
dipole: 6.3022
quadrupole: -93.3920 -70.3591 -83.0487
quadrupole: -7.0154 0.0071 0.0046
quadrupole: -11.1254 11.9075 -0.7821 -7.0154 0.0071 0.0046
hfenergy: -660.9713877 hartree
pointgroup: C01 [X(C9H7N3O2)]
dipole: 1.9680677 -1.5081791 0.0007764 debye
dipolederiv: -0.9289703 0.2918068 0.0000247 0.4780662 -0.6595184 -0.0001116 0.0000365 -0.0001278 -0.2338904 -0.7203103 -0.1352309 -0.0000284 -0.5368811 -0.7137742 -0.0002939 -0.0002486 -0.000166 -0.2874544 -0.6706644 0.1662563 -0.0000114 0.12384 -0.3064506 0.000005 0.0000325 -0.0000238 -0.2422712 -0.3711013 -0.2726239 -0.000197 -0.1366507 -1.1938182 -0.0000153 -0.0001461 -0.0003066 -0.578894 2.2059085 -0.2333625 0.000202 0.0973633 0.9885993 0.000484 0.0003876 0.000411 0.1898898 -0.1520409 -0.4082001 -0.0000432 0.2769567 -0.2829744 -0.0000219 -0.0000193 0.0000451 0.030842 0.5026605 0.3153482 0.0001028 -0.0350623 1.1193908 -0.0000125 -0.0000668 -0.0000039 0.1382718 0.6418311 -0.1348179 0.0000232 -0.6194366 0.2392413 -0.0000242 -0.0000799 0.0000224 0.0846588 -1.1292573 0.3665818 -0.0001364 -0.2214218 -0.2372653 -0.0000768 -0.0002303 -0.0000915 -0.0117865 -0.6867828 0.122899 -0.0000415 0.1373459 0.0305433 0.00004 -0.000032 0.0000471 -0.1832546 0.3400055 -0.0338737 0.000034 0.5352016 0.0919871 0.0000863 0.0002782 0.0000185 -0.102573 0.1996614 0.1480651 0.0000422 -0.1240575 0.1006247 0.0000168 0.0000183 0.0000545 -0.1189041 -0.222402 -0.2190685 -0.0000241 -0.2099999 -0.1751916 -0.0000215 0.0000024 -0.0000235 -0.1195965 0.4496412 -0.0040822 0.0000335 0.096016 0.3678711 0.000051 0.0000399 0.0000553 -0.046638 0.0753052 -0.0544088 -0.0000156 -0.0039824 -0.0145582 -0.0000255 -0.0000236 -0.0000259 0.1633511 0.0872733 0.0803364 0.0000026 -0.0053931 0.0910556 -0.0000065 -0.0000103 -0.0000083 0.1674017 0.0817715 -0.0993062 -0.0000198 -0.0300295 -0.0933245 -0.0000255 -0.0000272 -0.0000266 0.1405015 -0.0150306 0.0878928 -0.0000035 0.1126559 0.0034493 -0.0000101 -0.0000058 -0.0000142 0.1678634 0.2693517 -0.0323872 0.0000173 0.0546178 0.2945937 -0.0000543 0.0000676 0.0000578 0.366003 0.1727966 0.0758399 0.0000604 0.0559827 0.2651635 0.0000248 0.0000654 0.0001138 0.3468476 -0.1296467 -0.0276643 -0.0000216 -0.0451312 0.0843555 -0.0000082 -0.0000384 -0.0000075 0.129632 unknown
polarizability: 220.7848978|-10.5833694|143.8005616|0.0160272|0.0148369|48.0488746 unknown
InChI: InChI=1S/C9H7N3O2/c10-9-6-2-1-5-11-7(6)3-4-8(9)12(13)14/h1-5H,10H2
charge 0 multiplicity 1
21 atoms
O  -3.703346 1.050616 -0.000194
O  -3.373916 -1.203102 -0.001217
N  2.634141 1.256218 0.000232
N  -0.953737 -2.142856 -0.00029
N  -2.909222 0.03115 -0.000524
C  0.881284 -0.502842 -0.000133
C  -0.541598 -0.836969 -0.000247
C  1.297745 0.881782 0.000095
C  -1.472393 0.252264 -0.000196
C  0.315545 1.930232 0.000215
C  -1.032226 1.616627 0.000066
C  1.907527 -1.496408 -0.000163
C  3.252585 -1.11149 -0.000013
C  3.566001 0.280778 0.000172
H  0.673543 2.96224 0.000391
H  -1.802569 2.391335 0.00008
H  1.668088 -2.565763 -0.000302
H  4.055367 -1.854267 -0.000036
H  -1.974362 -2.29788 0.000342
H  -0.290352 -2.91234 -0.000364
H  4.610996 0.613075 0.000285
