program: Gaussian 09
title: 000117636
version: EM64L-G09RevD.01
frameworkgroup: C1[X(C9H11NO3)]
method: RPBEPBE
basis: SDD
operation: Freq
keyword: #p
keyword: freq=noraman
keyword: PBEPBE/SDD
title: #p freq=noraman PBEPBE/SDD
converged: YES YES NO NO
title: Mulliken charges:
elementType: O O O N C C C C C C C C C H H H H H H H H H H H
charge: -0.430732 -0.442924 -0.313740 -0.406237 0.313329 -0.374239 0.084085 -0.357204 -0.361233 -0.302072 -0.220316 -0.261928 0.135283 0.216793 0.213034 0.391751 0.236222 0.234386 0.197480 0.272546 0.223657 0.230907 0.339179 0.381973
chargesum: 0.00000
title: Mulliken charges with hydrogens summed into heavy atoms:
elementType: O O O N C C C C C C C C C
charge: -0.091553 -0.060951 -0.313740 -0.014486 0.313329 0.055588 0.084085 -0.120981 0.070632 -0.029526 0.003341 -0.031021 0.135283
polarizability: 1.55615149e+02 2.49991684e+00 1.43641518e+02 -1.45921915e+00 -1.05043727e+00 5.99347644e+01
1716.lowfreq: -0.0004 -0.0002 0.0010 1.5439 2.0352 11.0159 40.9948 67.1233 88.2969
frequency: 40.9893 67.1168 88.2942 119.5780 135.2305 168.6383 237.7143 246.6196 276.9323 338.6690 365.1987 390.1632 424.7098 482.0108 523.1211 529.8923 569.9904 592.3323 617.3912 681.0877 736.4378 747.6515 759.0020 786.4928 815.1024 848.9442 875.5200 920.2273 964.1377 985.2635 1000.9194 1021.2794 1043.1759 1055.2434 1101.5063 1139.2765 1165.3762 1176.6797 1179.6374 1239.9969 1263.4373 1317.0990 1321.2928 1339.4562 1362.3575 1384.5824 1398.0605 1443.2094 1450.2155 1463.7640 1477.4977 1518.6784 1581.5381 1596.7159 1639.6763 2907.0591 2971.0248 2985.0841 3087.2398 3128.1062 3154.0623 3164.7465 3179.2742 3344.9161 3533.8151 3554.9292
redmass: 4.9053 4.3171 6.6816 3.9669 4.1059 4.4273 4.9136 3.9240 2.7122 1.2666 3.8779 7.4027 3.0665 3.2931 3.0910 5.1320 1.1958 4.0904 5.6521 3.9565 4.3680 1.8817 1.4304 1.6628 2.7550 1.5610 2.9720 2.5006 1.3629 1.3273 5.4407 1.5529 2.2692 2.3696 2.3498 2.0931 1.5493 1.1179 1.3218 1.2372 1.4544 1.8988 1.3025 2.0240 1.6498 1.2183 4.3819 2.0514 2.8611 1.0879 1.0952 3.2702 5.2637 3.7016 6.3885 1.0668 1.0732 1.0873 1.0967 1.0867 1.0893 1.0942 1.0986 1.0798 1.0641 1.0662
irintensity: 1.4522 4.9566 1.2365 4.6669 0.1589 2.1007 4.4897 9.9665 10.8885 208.1494 5.0538 5.9644 11.4499 20.2740 7.7677 4.3914 121.0858 23.0115 19.4227 39.6084 6.9910 13.1156 141.3111 39.3335 5.7498 0.1904 33.0535 3.8480 2.9350 0.2089 254.1096 75.2188 27.3107 5.9083 118.1692 34.8830 127.2406 4.4228 9.4545 43.6904 1.9003 54.4298 22.0548 107.4196 1.2297 13.9139 4.4041 52.0941 7.8044 11.6670 52.7623 190.0503 176.9828 75.8395 315.6817 82.9333 46.1629 86.5216 24.5689 9.4064 14.5195 17.6733 11.7345 117.9407 53.0671 6.4691
temp: 298.150 k
press: 1.00000 atm
elementType: 8 8 8 7 6 6 6 6 6 6 6 6 6 1 1 1 1 1 1 1 1 1 1 1
symmnumber: 1
zpe: 496602.1 jmol-1
zpe.correction: 0.189146 hartree
zpe.thermalcorrener: 0.201447 hartree
zpe.thermalcorrenthalpy: 0.202392 hartree
zpe.thermalcorrgfe: 0.149969 hartree
zpe.sumelectzpe: -629.020712 hartree
zpe.sumelectthermal: -629.008411 hartree
zpe.sumelectthermalent: -629.007467 hartree
zpe.sumelectthermalfe: -629.059889 hartree
dipole: 0.8192 -2.9896 0.6656
dipole: 3.1705
quadrupole: -71.1749 -69.2884 -76.3212
quadrupole: -10.8961 2.5044 -0.0480
quadrupole: 1.0866 2.9731 -4.0597 -10.8961 2.5044 -0.0480
hfenergy: -629.2098581 hartree
pointgroup: C01 [X(C9H11N1O3)]
dipole: 0.2988277 1.1871721 -0.239206 debye
dipolederiv: -0.8383004 0.0920165 0.0222074 0.1774315 -0.4421772 -0.2769034 0.0646661 -0.3021713 -0.3708036 -0.8032004 -0.7478935 -0.0029505 -0.5806005 -0.9920022 -0.0050114 -0.0032534 -0.0097795 -0.4276123 -0.8576178 0.3424208 -0.0046762 0.1834756 -0.9341075 0.0016386 -0.0029746 0.0127578 -0.3410558 -1.6191338 -0.1467649 -0.044722 0.2718352 -0.3288694 0.0421148 -0.1917827 0.0014451 -0.4255232 1.4321434 0.0742702 0.0569573 -0.6640586 0.1323449 -0.0336344 0.0807146 0.0037321 0.1516079 0.5040169 0.2650909 -0.021473 0.5623618 0.2695309 -0.0620569 -0.0359305 -0.0253713 0.3196996 -0.3922081 0.4349223 -0.013742 -0.253813 -0.9845214 -0.0061303 -0.0103071 0.0166098 -0.0731017 -0.4385742 -0.0622677 -0.0123686 0.6184745 0.0013393 0.0126782 -0.0127745 -0.0025564 -0.2479855 0.5282346 -0.0679645 -0.0560452 -0.1290613 0.4382915 0.1969951 -0.030573 0.2159306 0.4212411 0.0857588 -0.5000619 0.0094233 0.0560082 0.452089 -0.0004224 0.0085058 -0.0170077 -0.0877236 0.4514105 0.3392857 0.0189507 0.0331027 0.2808223 -0.0020538 0.0180173 0.0053465 -0.1061142 -0.1039876 -0.1325505 0.0038444 -0.2079795 -0.6406384 -0.0064607 0.0074012 -0.0005246 -0.230542 1.2067999 0.0577384 0.0058301 0.272436 2.1845946 0.0017394 0.0029923 -0.0052006 0.223893 -0.0021228 0.057453 0.0496089 -0.0975309 -0.0816415 -0.1099166 -0.0223637 -0.1199812 -0.0317623 -0.0800143 -0.0238592 0.010351 -0.1817263 -0.0327023 0.0829543 0.1072444 0.1375542 -0.1419423 0.2850139 0.0085922 -0.010781 0.0102153 0.3232023 -0.0022504 0.0139082 -0.0146041 0.3002693 -0.0254714 -0.1162096 -0.0017407 -0.0943799 0.0021539 0.0019049 -0.0026915 -0.0026104 0.1652323 0.1106252 0.0055633 0.0390547 0.0497887 0.020315 0.0748151 0.0063616 0.0268314 -0.0981348 -0.1613256 -0.1138415 -0.0163837 -0.1314989 -0.114053 -0.0744012 0.0357733 -0.0269251 0.0547515 0.0363854 -0.0603468 -0.0036147 -0.0800448 0.0637994 -0.0025208 -0.0025931 -0.0022864 0.1542982 0.0832811 0.050379 -0.0024601 0.0629136 -0.1229882 0.0057568 -0.0040768 0.005367 0.1472921 -0.1135444 0.0636715 -0.0093137 0.0527753 0.0587103 0.002832 -0.0106691 0.0027332 0.1754604 0.466052 -0.0070779 -0.0141677 -0.0411873 0.1761028 0.157525 -0.0136571 0.1008606 0.0750415 0.2457792 0.1874343 -0.001789 0.1110627 0.2704048 0.0008082 -0.0019377 -0.0001499 0.3935142 unknown
polarizability: 155.6902972|-2.2700957|143.5503879|2.1428507|0.4099575|59.9507462 unknown
InChI: InChI=1S/C9H11NO3/c11-6-5-10-8-4-2-1-3-7(8)9(12)13/h1-4,10-12H,5-6H2
charge 0 multiplicity 1
24 atoms
O  3.951191 -0.689425 -0.410955
O  -1.92517 -2.699278 0.018458
O  0.360466 -2.343368 0.04731
N  1.238214 0.204977 0.134185
C  -0.088705 0.574372 0.06273
C  2.348565 1.154655 0.143078
C  -1.144669 -0.419297 0.027223
C  -0.47551 1.955521 0.028204
C  3.665541 0.438545 0.485799
C  -2.506215 -0.006247 -0.019312
C  -1.827107 2.327421 -0.01871
C  -2.859276 1.351016 -0.038998
C  -0.80908 -1.845368 0.033587
H  2.179556 1.945449 0.903772
H  2.443874 1.670887 -0.840814
H  1.446894 -0.805562 0.074975
H  0.293123 2.733474 0.032883
H  3.599483 -0.023825 1.484472
H  4.494023 1.17745 0.486796
H  -3.274111 -0.784546 -0.041144
H  -2.08565 3.392731 -0.043252
H  -3.910209 1.653094 -0.074698
H  4.039047 -0.359263 -1.34146
H  -1.591274 -3.635914 0.020271
