program: Gaussian 09
title: 000117617
version: EM64L-G09RevD.01
frameworkgroup: C1[X(C14H29NO)]
method: RPBEPBE
basis: SDD
operation: Freq
keyword: #p
keyword: freq=noraman
keyword: PBEPBE/SDD
title: #p freq=noraman PBEPBE/SDD
converged: YES YES NO NO
title: Mulliken charges:
elementType: O N C C C C C C C C C C C C C C H H H H H H H H H H H H H H H H H H H H H H H H H H H H H
charge: -0.247246 -0.084072 -0.352059 -0.403081 -0.376438 -0.386597 -0.382167 -0.334655 -0.343417 -0.383304 -0.371927 -0.326740 -0.320287 -0.353910 -0.356444 -0.696576 0.205412 0.177176 0.201770 0.211471 0.191194 0.191608 0.195000 0.193566 0.192583 0.193067 0.212205 0.185819 0.187920 0.209139 0.192147 0.192664 0.189180 0.189498 0.212674 0.191526 0.191829 0.211998 0.187690 0.187876 0.194858 0.194633 0.209705 0.215055 0.209658
chargesum: 0.00000
title: Mulliken charges with hydrogens summed into heavy atoms:
elementType: O N C C C C C C C C C C C C C C
charge: -0.247246 -0.084072 0.030529 0.010160 0.006364 0.001969 0.003483 0.063369 0.053642 0.001506 0.006751 0.077460 0.083540 0.021656 0.033047 -0.062159
polarizability: 2.10784810e+02 -1.84755367e+00 1.46915238e+02 -1.58255501e+00 6.06745849e-01 1.30992255e+02
1716.lowfreq: -24.1462 -8.0033 -4.1360 -0.0014 0.0005 0.0009 15.3605 24.4906 42.4580
frequency: 13.8283 24.1747 38.0096 44.2112 69.6983 74.8818 80.1962 109.7966 118.1731 134.6802 147.6098 148.6432 156.8686 191.7390 230.7885 235.0852 247.8355 306.6454 315.9457 337.6977 392.6064 427.6097 438.2457 466.7384 488.6101 507.3941 602.2314 720.1444 724.3076 734.0499 754.9628 762.6199 792.2830 806.7908 840.3745 843.8912 888.2365 895.3835 908.7004 967.8332 978.2553 998.3063 1001.5897 1021.4199 1026.7674 1030.8274 1052.2302 1054.6813 1062.4099 1074.8474 1080.1091 1081.7362 1089.3617 1096.8779 1119.1480 1128.6770 1137.7539 1172.2342 1186.9021 1189.0707 1209.5277 1215.2862 1237.0593 1245.1340 1255.0047 1264.7282 1273.7471 1279.4693 1281.9283 1286.1064 1289.8708 1292.5112 1294.4073 1300.5713 1311.2876 1330.0844 1336.8339 1344.0609 1353.1113 1356.0251 1358.3134 1362.2168 1369.9896 1389.5141 1391.6626 1443.2899 1447.3895 1450.8801 1457.5896 1460.2478 1460.6975 1463.9699 1464.6231 1467.3721 1472.1963 1476.9262 1477.6850 1483.0634 1487.4328 1489.7111 2828.6935 2848.9409 2862.7196 2949.4399 2949.8082 2951.6819 2952.3928 2952.5257 2956.3511 2957.1880 2962.9830 2968.0885 2971.2408 2973.6227 2982.4349 2986.5623 2993.0791 2999.0944 3003.1174 3015.8382 3023.3935 3028.3221 3038.8814 3044.7640 3049.1552 3067.7468 3069.7820 3077.8721 3081.1088
redmass: 3.9726 4.1354 1.9079 3.0973 1.8236 2.9367 3.1546 1.6801 2.5886 3.3399 1.9104 2.4740 3.1456 2.7758 1.1208 1.8908 2.9378 2.6685 3.3875 3.1008 1.9024 3.4489 3.4906 2.8284 3.4213 3.2369 1.8821 1.0601 1.0722 1.0943 1.1420 3.5897 1.1922 3.8159 1.5076 1.2887 1.8976 2.0012 1.3628 1.2273 4.1241 3.4937 3.5748 1.1168 2.1396 3.2930 2.2568 2.9925 2.6698 2.6998 2.0870 2.2769 2.8417 2.0628 2.5436 2.5634 2.6373 2.1409 1.6899 1.0838 1.2844 1.4578 1.2654 1.3294 1.3577 1.2947 1.2267 1.0395 1.3085 1.0594 1.1852 1.1791 1.0982 1.2182 1.3405 1.2793 1.3561 1.3082 1.5872 1.6239 1.6383 1.4427 1.2700 1.2175 1.4564 1.0819 1.0804 1.0955 1.0919 1.0756 1.0747 1.0766 1.0647 1.0815 1.0835 1.0426 1.0839 1.0889 1.0932 1.0962 1.0706 1.0709 1.0690 1.0588 1.0586 1.0591 1.0596 1.0662 1.0665 1.0594 1.0589 1.0582 1.0370 1.0611 1.0961 1.0974 1.0992 1.0866 1.1014 1.1039 1.0891 1.1045 1.1041 1.0934 1.0989 1.1006 1.0993 1.0961 1.0978
irintensity: 0.1298 0.0949 0.0529 0.0990 0.0588 0.2890 0.1302 0.0261 0.2354 0.2469 0.0541 0.3241 0.9253 3.3645 0.0179 2.6355 0.9606 10.6158 3.7453 0.8677 0.0676 1.8085 0.1159 1.0818 1.3002 0.2327 8.2937 16.0407 0.3054 5.2549 0.2712 9.2680 2.0421 24.8368 0.3917 0.7965 4.9585 9.8546 1.6444 1.3788 8.4470 13.6567 1.8527 0.0680 8.7675 2.9132 26.4599 3.2629 3.8121 8.0005 0.2642 0.1988 22.9680 11.4851 28.9825 24.3473 28.4509 1.8501 0.1595 2.4379 16.8723 0.6602 10.1569 0.4876 11.6748 5.0461 0.2508 1.0242 2.1862 0.7044 1.0323 2.1520 1.1407 7.5104 1.4561 6.5613 2.4298 7.6531 1.4105 0.0191 0.1970 2.5709 2.8893 11.3422 7.2151 2.2837 2.0841 19.3846 2.7373 0.0194 0.4661 0.2393 0.0591 0.5728 0.7759 12.4463 1.3644 1.2407 1.6470 37.0915 58.0750 52.1446 162.2820 0.0098 0.3699 3.2235 1.1747 31.5334 106.1127 0.9141 60.2443 159.2483 33.8272 62.7495 0.2731 0.6682 1.5491 27.2017 1.2475 1.5575 46.4700 2.2833 67.0461 119.4268 133.4547 97.7553 56.5800 44.8155 36.7703
temp: 298.150 k
press: 1.00000 atm
elementType: 8 7 6 6 6 6 6 6 6 6 6 6 6 6 6 6 1 1 1 1 1 1 1 1 1 1 1 1 1 1 1 1 1 1 1 1 1 1 1 1 1 1 1 1 1
symmnumber: 1
zpe: 1075150.2 jmol-1
zpe.correction: 0.409503 hartree
zpe.thermalcorrener: 0.429123 hartree
zpe.thermalcorrenthalpy: 0.430067 hartree
zpe.thermalcorrgfe: 0.358166 hartree
zpe.sumelectzpe: -679.490462 hartree
zpe.sumelectthermal: -679.470842 hartree
zpe.sumelectthermalent: -679.469898 hartree
zpe.sumelectthermalfe: -679.541799 hartree
dipole: -1.9562 -0.6147 0.1082
dipole: 2.0533
quadrupole: -126.0860 -98.8718 -102.3712
quadrupole: -4.6942 -1.8779 1.3861
quadrupole: -16.9763 10.2379 6.7384 -4.6942 -1.8779 1.3861
hfenergy: -679.8999649 hartree
pointgroup: C01 [X(C14H29N1O1)]
dipole: 0.770254 0.2313634 0.0761403 debye
polarizability: 210.7679825|-2.2475164|146.7959587|1.4210475|1.5623297|131.1283623 unknown
InChI: InChI=1S/C14H29NO/c1-2-3-4-5-6-7-8-9-10-15-11-13-16-14-12-15/h2-14H2,1H3
charge 0 multiplicity 1
45 atoms
O  -6.686925 -0.565811 -0.049813
N  -3.896004 0.267297 -0.146042
C  -2.601741 0.744858 0.403728
C  -1.382797 -0.071478 -0.072095
C  -0.047657 0.597683 0.327222
C  1.195253 -0.222351 -0.085636
C  2.527679 0.480194 0.260139
C  -4.285845 -1.077174 0.353335
C  -4.990979 1.238947 0.114397
C  3.777077 -0.338887 -0.134923
C  5.105535 0.38591 0.179494
C  -5.600076 -1.525609 -0.306767
C  -6.292466 0.762472 -0.548893
C  6.359088 -0.432423 -0.203999
C  7.685232 0.303022 0.09724
C  8.93361 -0.522498 -0.282742
H  -2.472723 1.792809 0.066531
H  -2.616428 0.767162 1.526155
H  -1.410118 -1.095562 0.351193
H  -1.438913 -0.175425 -1.173491
H  -0.027856 0.761604 1.425409
H  0.0098 1.603969 -0.138388
H  1.158101 -0.419548 -1.177404
H  1.162967 -1.214715 0.410984
H  2.561823 1.466534 -0.248502
H  2.558431 0.692195 1.349631
H  -3.493784 -1.805709 0.103228
H  -4.414732 -1.075161 1.466823
H  -5.17057 1.372189 1.212289
H  -4.703418 2.222187 -0.305007
H  3.735285 -0.571052 -1.21986
H  3.758056 -1.315644 0.392382
H  5.125888 1.358542 -0.35563
H  5.143509 0.627325 1.262663
H  -5.949087 -2.484161 0.112063
H  -5.44524 -1.629491 -1.402666
H  -6.153995 0.721659 -1.651058
H  -7.134065 1.43176 -0.304283
H  6.318449 -0.682851 -1.285002
H  6.347033 -1.400661 0.339197
H  7.697728 1.268117 -0.449452
H  7.722892 0.55732 1.176392
H  8.935887 -0.762871 -1.362874
H  9.867255 0.024937 -0.056547
H  8.959543 -1.479209 0.272579
