program: Gaussian 09
title: 000117602
version: EM64L-G09RevD.01
frameworkgroup: C1[X(C7H10N2O)]
method: RPBEPBE
basis: SDD
operation: Freq
keyword: #p
keyword: freq=noraman
keyword: PBEPBE/SDD
title: #p freq=noraman PBEPBE/SDD
converged: NO YES NO NO
title: Mulliken charges:
elementType: O N N C C C C C C C H H H H H H H H H H
charge: -0.252290 -0.001801 -0.338042 -0.163981 0.086054 -0.700956 -0.701146 0.068772 -0.310686 -0.115994 0.259114 0.233548 0.219111 0.216671 0.218864 0.233880 0.216437 0.341810 0.243460 0.247175
chargesum: 0.00000
title: Mulliken charges with hydrogens summed into heavy atoms:
elementType: O N N C C C C C C C
charge: -0.252290 -0.001801 0.003768 0.095134 0.086054 -0.031626 -0.031965 0.068772 -0.067226 0.131181
polarizability: 1.16973907e+02 8.32125363e+00 9.95056161e+01 -3.42689670e-02 -7.98814332e-02 5.78563822e+01
1716.lowfreq: -17.9304 -0.0007 -0.0004 -0.0004 12.2718 16.6008 17.0248 96.8276 179.5004
frequency: -17.5918 96.8260 179.4999 185.1711 219.5329 256.3394 272.5772 327.2138 400.5716 471.7548 511.7897 541.4281 564.1221 571.4774 701.0412 753.7085 798.0354 800.1637 844.4952 899.0854 908.7712 925.4615 958.5180 1013.4829 1054.3587 1093.1060 1104.6472 1155.3691 1193.9333 1224.4427 1244.4937 1321.1389 1354.5401 1367.5010 1373.9510 1391.7160 1430.9560 1463.2117 1471.6802 1476.2724 1486.8882 1500.0100 1578.0536 1615.0515 2979.2894 2981.2743 3030.7588 3075.6714 3080.0460 3086.0878 3094.1852 3165.0722 3193.4135 3508.6115
redmass: 3.2802 4.2116 3.4124 2.9793 1.0584 1.2729 2.3912 3.9495 2.9953 4.2642 5.7415 5.7340 4.7512 3.6473 3.6693 1.3907 5.2792 1.3069 4.7030 3.2881 1.3381 1.1647 1.4674 2.6831 2.9543 1.6245 2.7828 2.0454 1.9132 2.9243 1.6480 1.2784 1.5627 1.1876 1.5670 1.3407 2.3185 1.0459 1.0484 1.0504 1.5924 2.2192 3.9511 6.4631 1.0341 1.0346 1.0852 1.1006 1.0996 1.1012 1.0997 1.0886 1.1011 1.0780
irintensity: 0.2204 11.7724 0.6063 5.9526 0.0050 1.9531 1.4429 5.6079 4.3284 1.4672 3.0612 6.2013 2.7186 0.0348 1.1182 117.1086 40.9295 7.2670 7.6433 10.0915 1.8573 5.9112 0.0811 0.9232 51.8961 16.0481 0.4317 1.0865 6.5351 31.7837 1.7848 0.0096 13.1712 14.3285 1.9953 14.6747 2.8932 7.5484 1.0535 17.8065 6.0316 17.8055 74.3764 294.9929 38.7776 30.2446 1.3318 21.4452 54.6580 3.7525 44.4726 0.0602 22.7283 50.9525
temp: 298.150 k
press: 1.00000 atm
elementType: 8 7 7 6 6 6 6 6 6 6 1 1 1 1 1 1 1 1 1 1
symmnumber: 1
zpe: 426449.6 jmol-1
zpe.correction: 0.162426 hartree
zpe.thermalcorrener: 0.171244 hartree
zpe.thermalcorrenthalpy: 0.172188 hartree
zpe.thermalcorrgfe: 0.128925 hartree
zpe.sumelectzpe: -456.717044 hartree
zpe.sumelectthermal: -456.708227 hartree
zpe.sumelectthermalent: -456.707283 hartree
zpe.sumelectthermalfe: -456.750546 hartree
dipole: -3.3597 -1.7161 0.0109
dipole: 3.7726
quadrupole: -43.4153 -68.6469 -61.0160
quadrupole: 1.6459 -0.0076 0.0205
quadrupole: 14.2774 -10.9541 -3.3233 1.6459 -0.0076 0.0205
hfenergy: -456.8794704 hartree
pointgroup: C01 [X(C7H10N2O1)]
dipole: 1.3381243 -0.6422117 0.00101 debye
dipolederiv: -0.4439376 0.0643682 -0.0002981 0.2616128 -1.2718221 0.0022623 -0.0006208 0.0014201 -0.3775537 -0.0925366 -0.1981198 0.0003013 0.0868562 -0.1209517 0.0005254 -0.0006064 -0.0002823 -0.2294456 -0.2899534 0.5324255 -0.0007513 -0.4197836 -0.4862477 -0.0002165 0.0007188 0.0009903 -0.2704854 -0.1513615 0.0139608 -0.001268 -0.1905796 0.065184 0.0000059 -0.0053774 0.0007777 0.0222176 0.7699173 -0.2380254 0.002702 0.1661496 -0.3391015 0.0005279 0.0025588 0.0008415 -0.0062839 -0.002542 -0.0212275 -0.0386858 0.0752513 0.054587 -0.0140741 0.0835557 -0.0478364 0.0002082 -0.0014086 -0.0220013 0.038879 0.0756973 0.0532856 0.0149837 -0.0802381 0.0482004 0.0003845 0.2427789 -0.3139429 0.0006297 -0.439428 1.3776876 -0.0029765 0.0015814 -0.0026816 0.2756867 -0.2855924 0.1497587 -0.000662 -0.3904255 0.1672137 -0.0010901 0.0008394 -0.0007312 -0.1544869 0.05587 -0.1399199 0.0002842 0.6131732 0.3291074 0.000191 -0.0012833 -0.0009912 -0.034762 0.0954518 -0.0237075 0.0001784 0.0487856 -0.0642605 -0.0007412 0.0006048 -0.0005864 0.0376591 0.1041625 0.0499599 -0.0037945 -0.007263 -0.1122727 -0.0421695 -0.0024485 0.0252208 0.0782289 0.0701058 -0.0546755 0.0973959 -0.03615 0.0432277 0.0880334 0.0555945 0.0586846 -0.1226867 -0.216145 0.0415594 -0.034534 0.0287312 0.0887309 -0.017978 -0.0224305 -0.0127006 0.0747466 0.0708306 -0.0534507 -0.096649 -0.0353791 0.0443411 -0.0867453 -0.0540499 -0.0581147 -0.1253425 0.1052648 0.0501419 0.0036611 -0.0075773 -0.1118907 0.0402315 0.0021249 -0.026511 0.0786829 -0.2164066 0.0408859 0.0331755 0.0287394 0.0885891 0.0180398 0.0200475 0.0130065 0.0753106 0.2097025 0.0280319 -0.0001341 0.0284101 0.1512256 0.0004387 -0.0002062 0.0004766 0.325766 0.0472036 0.0477206 -0.0001648 0.1031876 -0.0433224 0.0005288 -0.0001487 0.0005943 0.1704402 -0.071404 0.0462576 -0.0002655 0.0099918 0.0866896 0.0002227 -0.000216 0.0002226 0.1817154 unknown
polarizability: 117.3753296|-7.8781376|99.1038028|0.0973672|-0.138173|57.8567728 unknown
InChI: InChI=1S/C7H10N2O/c1-5(2)6-7(10)9-4-3-8-6/h3-5,9H,1-2H3
charge 0 multiplicity 1
20 atoms
O  0.360771 2.326012 -0.00397
N  0.119269 -1.329984 0.003921
N  2.029287 0.685728 0.000709
C  -1.772686 0.250983 -0.001072
C  -0.283627 -0.053599 0.001083
C  -2.436112 -0.318079 -1.284099
C  -2.443662 -0.330299 1.272265
C  0.664083 1.092638 -0.00166
C  1.478276 -1.628669 0.005184
C  2.443549 -0.635771 0.003809
H  -1.87788 1.350955 0.003364
H  -2.292266 -1.412066 -1.331721
H  -2.002537 0.130722 -2.19633
H  -3.519914 -0.101981 -1.277956
H  -2.01643 0.11073 2.191257
H  -2.298631 -1.424432 1.3111
H  -3.527692 -0.115432 1.261169
H  2.710994 1.451812 -0.000339
H  1.750587 -2.685692 0.00757
H  3.518122 -0.834075 0.005015
