program: Gaussian 09
title: 000117600
version: EM64L-G09RevD.01
frameworkgroup: C1[X(C11H18O)]
method: RPBEPBE
basis: SDD
operation: Freq
keyword: #pfreq=noraman
keyword: PBEPBE/SDD
title: #p freq=noraman PBEPBE/SDD
converged: YES YES NO NO
title: Mulliken charges:
elementType: O C C C C C C C C C C C H H H H H H H H H H H H H H H H H H
charge: -0.231594 -0.409827 -0.535072 -0.394548 0.309013 -0.498232 0.021837 -0.280881 -0.461164 -0.345518 -0.344078 -0.693156 0.202009 0.211610 0.213557 0.216021 0.204563 0.212487 0.247983 0.229263 0.269398 0.213536 0.208173 0.200452 0.203798 0.195268 0.194542 0.211080 0.217282 0.212200
chargesum: 0.00000
title: Mulliken charges with hydrogens summed into heavy atoms:
elementType: O C C C C C C C C C C C
charge: -0.231594 0.003791 -0.105495 0.022502 0.309013 -0.020987 0.021837 -0.011484 -0.039455 0.058732 0.045732 -0.052593
polarizability: 1.65749595e+02 -1.45272376e+00 1.13428601e+02 7.07215190e+00 1.08592453e+00 9.06753547e+01
1716.lowfreq: -16.5056 -8.8454 -3.4266 0.0004 0.0005 0.0006 18.8239 47.1679 56.5722
frequency: 18.5895 46.9377 56.4538 69.7927 104.6652 111.6663 207.3077 213.7203 242.2935 256.2777 297.6397 355.7299 403.4339 418.8907 454.0261 460.3497 536.7475 590.1481 629.1676 681.0282 726.8172 785.4508 815.9924 852.6561 870.7428 887.0464 906.2206 914.4739 943.4258 973.5220 1004.9458 1044.9889 1066.6771 1074.9337 1077.2679 1098.7522 1102.7225 1123.7184 1145.1617 1167.2925 1208.3970 1239.6186 1243.6130 1259.7318 1265.3294 1276.0868 1285.1843 1313.7761 1316.5077 1324.0289 1338.9380 1344.3933 1347.5108 1366.5685 1390.1763 1434.7010 1458.0160 1460.6812 1465.8846 1471.1141 1476.7278 1476.9634 1478.3996 1487.0080 1554.6703 1646.6171 2950.1904 2954.9682 2963.3136 2963.3746 2973.6717 2974.5967 2978.3419 2981.0526 3003.4264 3022.9066 3029.7405 3039.0046 3045.3247 3045.9861 3057.7831 3071.3684 3073.4291 3085.4953
redmass: 2.8680 2.5706 1.8856 4.5197 2.3097 2.2769 3.4127 2.0136 1.2408 4.5036 1.7688 2.8186 3.3215 3.3587 2.2432 3.9264 3.4898 2.4151 2.8719 3.0642 1.1112 1.2668 1.5155 1.8252 2.3987 1.9291 1.5696 1.4321 1.3840 2.5337 3.4232 1.9241 2.4286 1.9131 1.9200 1.5245 1.9907 1.1893 2.3355 2.2975 1.4822 1.3676 1.3099 1.3223 1.4225 1.3585 1.0906 1.5410 1.4544 1.3061 1.4438 1.5567 1.4956 1.6716 1.2123 1.0799 1.0853 1.0835 1.0724 1.0858 1.0789 1.0809 1.0423 1.0805 10.0598 8.2385 1.0648 1.0664 1.0590 1.0663 1.0483 1.0476 1.0626 1.0614 1.0980 1.0962 1.0933 1.0977 1.1015 1.1015 1.0956 1.1007 1.0994 1.0885
irintensity: 0.6972 0.6650 0.4969 1.3228 0.1142 1.6683 0.1832 1.1821 0.2878 1.7608 0.4777 0.6270 1.4808 1.7801 2.4858 8.7500 2.0959 0.5472 6.0037 10.7290 9.2937 2.3754 21.0086 11.5565 9.4226 0.1793 21.9447 2.5989 14.5826 10.8633 2.0333 35.8560 5.5285 6.6789 0.8005 3.5018 7.1673 1.0409 53.1797 2.6704 3.9862 22.6377 2.2274 17.3057 26.4012 33.0790 1.6342 16.2037 4.9903 0.4291 1.8827 0.2833 2.1092 2.4497 11.8105 15.8168 5.1716 8.4408 0.3340 11.9697 11.1922 0.8124 13.0876 16.9898 171.9640 64.3557 10.6766 24.2752 15.6690 5.4728 25.6016 77.8860 31.9660 40.7623 3.2815 7.1070 38.0737 55.8247 52.9432 47.8785 30.6655 82.3757 52.3771 9.7271
temp: 298.150 k
press: 1.00000 atm
elementType: 8 6 6 6 6 6 6 6 6 6 6 6 1 1 1 1 1 1 1 1 1 1 1 1 1 1 1 1 1 1
symmnumber: 1
zpe: 693130.0 jmol-1
zpe.correction: 0.263999 hartree
zpe.thermalcorrener: 0.277335 hartree
zpe.thermalcorrenthalpy: 0.278279 hartree
zpe.thermalcorrgfe: 0.222142 hartree
zpe.sumelectzpe: -504.229956 hartree
zpe.sumelectthermal: -504.216621 hartree
zpe.sumelectthermalent: -504.215677 hartree
zpe.sumelectthermalfe: -504.271813 hartree
dipole: -0.8808 -3.5422 0.0465
dipole: 3.6504
quadrupole: -68.6744 -82.8513 -73.6601
quadrupole: -7.2606 1.9710 0.3367
quadrupole: 6.3876 -7.7894 1.4018 -7.2606 1.9710 0.3367
hfenergy: -504.4939554 hartree
pointgroup: C01 [X(C11H18O1)]
dipole: -0.4575081 -1.2068262 -0.62994 debye
polarizability: 164.726683|-9.2671125|108.7276282|5.5105381|9.6365008|96.3992402 unknown
InChI: InChI=1S/C11H18O/c1-2-3-4-7-10-8-5-6-9-11(10)12/h7H,2-6,8-9H2,1H3
charge 0 multiplicity 1
30 atoms
O  1.89894 1.831043 1.153789
C  2.122475 -2.087282 -0.437801
C  0.980792 -1.178633 -0.949936
C  3.417455 -1.269839 -0.255236
C  0.777435 0.082925 -0.11186
C  3.212043 -0.177075 0.815577
C  1.949079 0.673736 0.634469
C  -0.418454 0.744049 -0.004627
C  -1.73953 0.384254 -0.633268
C  -2.87926 0.249856 0.416137
C  -4.258633 -0.009431 -0.231067
C  -5.387377 -0.157085 0.812026
H  1.837667 -2.546701 0.530322
H  2.282455 -2.914849 -1.154717
H  0.038341 -1.754349 -1.008975
H  1.22291 -0.877259 -1.991532
H  3.69773 -0.805174 -1.221951
H  4.257522 -1.926097 0.041023
H  4.074369 0.509422 0.889318
H  3.114803 -0.661319 1.81117
H  -0.413395 1.649092 0.623325
H  -1.67351 -0.543798 -1.231346
H  -2.023655 1.193057 -1.341708
H  -2.926038 1.175009 1.026098
H  -2.635568 -0.574238 1.116155
H  -4.204793 -0.925896 -0.853611
H  -4.498038 0.823644 -0.923294
H  -5.186606 -1.002697 1.496439
H  -6.364494 -0.338353 0.327907
H  -5.479263 0.757487 1.427573
