program: Gaussian 09
title: 000015112
version: EM64L-G09RevD.01
frameworkgroup: C1[X(C3H6N2)]
method: RPBEPBE
basis: SDD
operation: Freq
keyword: #p
keyword: freq=noraman
keyword: PBEPBE/SDD
title: #p freq=noraman PBEPBE/SDD
converged: YES YES NO NO
title: Mulliken charges:
elementType: N N C C C H H H H H H
charge: -0.098817 -0.073813 -0.582675 -0.582678 -0.091886 0.231125 0.251856 0.231945 0.231133 0.231945 0.251865
chargesum: 0.00000
title: Mulliken charges with hydrogens summed into heavy atoms:
elementType: N N C C C
charge: -0.098817 -0.073813 0.132251 0.132265 -0.091886
polarizability: 6.19734938e+01 3.66554177e-04 3.66434074e+01 1.78235427e-01 2.62983841e-04 3.03033896e+01
1716.lowfreq: -15.5617 -9.6801 0.0004 0.0007 0.0008 9.6067 61.2222 132.0769 199.7952
frequency: 61.0678 131.8487 199.7932 200.0643 350.9947 474.4491 609.5172 744.9120 1055.9853 1060.5538 1087.2030 1136.2248 1213.3860 1350.1263 1429.5232 1445.4404 1462.8014 1470.7939 1478.9305 1500.4989 2182.8595 2958.0925 2962.6730 3038.6679 3041.8865 3112.7830 3115.4113
redmass: 1.4958 1.0338 1.7858 4.5978 2.4050 11.6359 6.3482 5.0927 1.8364 1.4751 1.2114 1.3472 4.9807 3.3179 1.1285 1.1476 1.0421 1.0461 1.0476 1.0922 12.2991 1.0377 1.0384 1.0996 1.0999 1.0984 1.0991
irintensity: 0.6544 0.0743 6.5425 2.6572 1.7171 4.1055 5.5422 5.7892 52.8857 13.4014 0.3836 1.3689 14.0266 15.7859 6.3651 3.7975 1.1232 39.5588 22.6315 7.1659 209.5757 44.4654 91.2345 78.8180 0.1371 4.7939 20.9220
temp: 298.150 k
press: 1.00000 atm
elementType: 7 7 6 6 6 1 1 1 1 1 1
symmnumber: 1
zpe: 232533.0 jmol-1
zpe.correction: 0.088567 hartree
zpe.thermalcorrener: 0.095029 hartree
zpe.thermalcorrenthalpy: 0.095974 hartree
zpe.thermalcorrgfe: 0.058515 hartree
zpe.sumelectzpe: -226.985179 hartree
zpe.sumelectthermal: -226.978717 hartree
zpe.sumelectthermalent: -226.977772 hartree
zpe.sumelectthermalfe: -227.015231 hartree
dipole: -5.2110 0.0005 0.0899
dipole: 5.2118
quadrupole: -39.1619 -26.4525 -30.9841
quadrupole: 0.0009 -0.1325 -0.0001
quadrupole: -6.9624 5.7471 1.2154 0.0009 -0.1325 -0.0001
hfenergy: -227.073746 hartree
pointgroup: C01 [X(C3H6N2)]
dipole: 2.0394671 -0.0001602 -0.2122341 debye
dipolederiv: -1.1041691 0.0000671 0.0943556 -0.0000854 -0.369496 0.0000285 -0.0109473 -0.0000025 -0.3127343 -0.6481695 -0.0001702 0.0245785 0.0001085 -0.2637993 -0.0000061 0.0363984 0.0000119 -0.2877486 0.3149475 -0.2705378 -0.0355672 -0.3681743 0.3335079 0.0746042 -0.0179397 0.0606536 0.3249031 0.3148711 0.2705133 -0.0355855 0.368217 0.3335068 -0.0746515 -0.0179782 -0.0606913 0.3249144 1.2847204 0.0000977 -0.0740594 -0.0000233 -0.2073236 0.0000038 -0.0787422 -0.0000054 0.0414987 -0.0033361 0.084299 0.078444 0.0689393 0.0413128 0.021768 0.1420434 -0.0725835 -0.1503993 0.0288707 -0.104781 0.0418467 -0.0523404 -0.0277258 0.0197304 0.0343578 0.0253631 0.1201078 -0.1066557 0.0789997 -0.1071563 0.0179071 0.0732142 -0.0505655 -0.131808 -0.0022082 -0.0151288 -0.0032972 -0.0842844 0.0784151 -0.0689612 0.0412986 -0.0217417 0.1420143 0.0726006 -0.1504233 -0.106669 -0.0789761 -0.1071492 -0.0179093 0.0732292 0.0505742 -0.1317761 0.0022382 -0.0150828 0.0288869 0.1047728 0.0418777 0.0523221 -0.0277249 -0.0197442 0.0343777 -0.0253765 0.120093 unknown
polarizability: 61.7680856|-0.0049873|36.6434083|-2.548499|-0.0000384|30.508797 unknown
InChI: InChI=1S/C3H6N2/c1-5(2)3-4/h1-2H3
charge 0 multiplicity 1
11 atoms
N  0.501915 -0.000064 0.052538
N  -2.043677 0.000317 0.180554
C  1.247585 -1.264028 -0.101083
C  1.24753 1.263932 -0.101143
C  -0.841147 -0.000119 0.108068
H  1.64397 -1.375998 -1.130597
H  0.583874 -2.115481 0.115115
H  2.09485 -1.289445 0.609721
H  1.643747 1.375989 -1.130712
H  2.094915 1.289342 0.609519
H  0.583837 2.115357 0.11522
