program: Gaussian 09
title: 000117548
version: EM64L-G09RevD.01
frameworkgroup: C1[X(C8H10S)]
method: RPBEPBE
basis: SDD
operation: Freq
keyword: #pfreq=noraman
keyword: PBEPBE/SDD
title: #p freq=noraman PBEPBE/SDD
converged: NO YES NO NO
title: Mulliken charges:
elementType: S C C C C C C C C H H H H H H H H H H
charge: -0.027752 0.479287 0.480211 -0.575455 -0.378378 -0.401357 -0.149537 -0.811615 -0.809418 0.236724 0.228363 0.244834 0.236282 0.223696 0.225800 0.225929 0.236390 0.224566 0.111429
chargesum: 0.00000
title: Mulliken charges with hydrogens summed into heavy atoms:
elementType: S C C C C C C C C
charge: 0.083677 0.479287 0.480211 -0.338731 -0.150015 -0.156523 -0.149537 -0.125838 -0.122532
polarizability: 1.35969730e+02 1.95822404e+00 1.17825824e+02 -2.95986840e-01 -4.95310669e-02 4.96531130e+01
1716.lowfreq: -10.4218 -4.1314 -0.0029 -0.0029 -0.0018 9.6269 26.4814 42.8418 140.3925
frequency: 26.0374 42.5909 140.3072 164.9846 203.2842 204.8138 214.5457 259.3753 387.1546 435.0967 501.6577 519.1380 524.8760 537.4742 689.2476 819.4813 845.8902 871.2923 872.4891 893.9403 952.9154 983.2919 990.9445 1016.9703 1044.3011 1049.1588 1126.1115 1176.3213 1274.5414 1289.0736 1373.2627 1395.7244 1396.5439 1425.0795 1436.1440 1474.1200 1474.6774 1477.1986 1479.7500 1591.1759 1609.9422 2446.2216 2975.0837 2975.7660 3056.8553 3057.5506 3085.2712 3086.0697 3113.0345 3118.4423 3130.1290
redmass: 1.0134 1.0178 2.0161 1.5539 4.5674 2.9927 3.0068 2.6309 9.2727 2.6314 4.4500 3.2694 4.1924 4.6475 2.1894 6.2987 1.4497 1.3262 1.2047 1.3469 2.9953 2.9402 1.8986 1.4715 1.5291 1.5826 1.5875 1.4240 3.8132 1.2642 7.9134 1.2249 1.2305 2.1810 2.5351 1.0542 1.0569 1.1821 1.2319 5.8154 6.1475 1.0382 1.0384 1.0384 1.0952 1.0951 1.0998 1.0999 1.0916 1.0917 1.0924
irintensity: 0.2263 0.6904 7.4815 29.8140 1.4764 0.0630 0.1954 1.1655 1.2756 1.2733 0.2163 0.1510 0.2609 2.3724 18.9909 35.3698 36.4003 3.9899 9.6098 0.2478 0.0542 5.5401 3.2149 1.4954 5.4116 27.9171 9.8958 0.3937 11.3308 1.9003 0.9651 18.4665 5.3888 0.4678 2.6878 2.2872 24.9706 14.5462 42.9218 86.7247 41.8963 17.7208 44.0625 23.1005 17.6511 28.1016 14.4624 20.5022 16.7820 14.6475 4.2527
temp: 298.150 k
press: 1.00000 atm
elementType: 16 6 6 6 6 6 6 6 6 1 1 1 1 1 1 1 1 1 1
symmnumber: 1
zpe: 396175.4 jmol-1
zpe.correction: 0.150895 hartree
zpe.thermalcorrener: 0.161078 hartree
zpe.thermalcorrenthalpy: 0.162022 hartree
zpe.thermalcorrgfe: 0.113867 hartree
zpe.sumelectzpe: -708.244905 hartree
zpe.sumelectthermal: -708.234722 hartree
zpe.sumelectthermalent: -708.233778 hartree
zpe.sumelectthermalfe: -708.281933 hartree
dipole: -1.4646 1.0543 0.1237
dipole: 1.8088
quadrupole: -59.3916 -53.2245 -66.3529
quadrupole: 4.0779 -0.2065 -0.0104
quadrupole: 0.2647 6.4319 -6.6966 4.0779 -0.2065 -0.0104
hfenergy: -708.3957999 hartree
pointgroup: C01 [X(C8H10S1)]
dipole: -0.5784335 0.4117371 0.0483499 debye
dipolederiv: -0.6226308 -0.0623947 -0.0021864 -0.10107 0.160146 -0.0021128 0.0006242 -0.0019656 -0.1788787 0.2498089 -0.1113781 -0.0055266 -0.0881113 0.3522412 0.0148372 -0.0364681 0.0748695 0.0100752 0.2821863 0.132336 -0.0059696 0.0958509 0.3584195 -0.015517 -0.0363154 -0.0755088 -0.0049385 -0.0544452 -0.0066022 -0.0116084 0.0153781 -0.3885022 0.0002128 0.0000685 0.0005435 -0.222458 -0.4936203 0.1431439 0.0077822 0.155681 -0.1208204 0.0095739 0.0083989 -0.0021907 -0.1985068 -0.4591691 -0.1638693 0.0073606 -0.1746284 -0.103504 -0.0083175 0.0087732 0.0028186 -0.1737792 1.1296116 0.0178488 -0.0044292 0.1422942 0.0581277 -0.0004349 0.0013567 -0.0002584 -0.0406393 0.0103331 0.0883193 0.004471 0.0825128 -0.089616 -0.0128402 0.0521483 -0.0945521 0.0630291 0.0139834 -0.0953995 0.006796 -0.0866557 -0.0944367 0.0126438 0.0547416 0.0959235 0.06351 -0.1291941 -0.0011803 -0.0026392 -0.0005296 0.0861667 0.000059 -0.013177 -0.0000204 0.1515604 0.0169667 -0.0935409 -0.0031176 -0.0778884 -0.0519757 0.001417 -0.0019559 0.0055547 0.1559691 0.0550077 0.0831342 -0.003108 0.0738075 -0.039057 -0.0018101 -0.0017706 -0.0057683 0.1587941 0.0735571 0.0574873 0.0236384 0.0618198 0.0042752 -0.0537515 0.0535724 -0.0985982 -0.1006505 0.0195039 -0.1096727 0.0779723 -0.0273536 -0.0587888 0.0732977 0.0299635 0.108119 0.055411 -0.1104513 0.0338266 -0.0942407 -0.0459261 0.0616494 -0.0297745 -0.1011578 0.0218951 0.0649469 0.0175599 0.1127364 0.0757426 0.0300313 -0.0562288 -0.0696303 0.0298298 -0.1041481 0.0605864 0.0734653 -0.0586206 0.0278831 -0.0604395 0.0063707 0.0504229 0.0561313 0.0957631 -0.1006295 -0.1078837 -0.0365964 -0.0980967 0.0432735 0.0598338 0.0297494 -0.1058914 -0.0242494 0.0610627 0.0354106 0.0704221 -0.0007239 -0.0380466 -0.1443005 0.0019749 0.0011276 0.0017733 0.1755356 unknown
polarizability: 135.9483739|2.0551452|117.847259|-0.2768099|-0.078278|49.6530345 unknown
InChI: InChI=1S/C8H10S/c1-6-3-7(2)5-8(9)4-6/h3-5,9H,1-2H3
charge 0 multiplicity 1
19 atoms
S  3.215702 -0.062017 -0.002561
C  -0.746781 1.241198 -0.01753
C  -0.735753 -1.2310 -0.016672
C  -1.434485 0.002537 -0.026067
C  0.670347 1.237811 -0.010506
C  0.680424 -1.215532 -0.010078
C  1.37772 0.014644 -0.004882
C  -1.509202 2.555724 0.004649
C  -1.487363 -2.551516 0.006538
H  -2.531808 -0.001965 -0.042706
H  1.209766 2.193644 -0.013431
H  1.233018 -2.162607 -0.013718
H  -1.677408 2.899511 1.043898
H  -0.956858 3.355186 -0.520359
H  -2.500035 2.45458 -0.471989
H  -0.917301 -3.351817 -0.497261
H  -1.672156 -2.88359 1.046768
H  -2.470057 -2.465344 -0.489819
H  3.437829 1.304453 -0.010775
