program: Gaussian 09
title: 000117540
version: EM64L-G09RevD.01
frameworkgroup: C1[X(CH2INO2)]
method: RPBEPBE
basis: SDD
operation: Freq
keyword: #p
keyword: freq=noraman
keyword: PBEPBE/SDD
title: #p freq=noraman PBEPBE/SDD
converged: NO YES NO NO
title: Mulliken charges:
elementType: I O O N C H H
charge: 0.177570 -0.174126 -0.173420 0.175014 -0.649292 0.322062 0.322191
chargesum: 0.00000
title: Mulliken charges with hydrogens summed into heavy atoms:
elementType: I O O N C
charge: 0.177570 -0.174126 -0.173420 0.175014 -0.005038
polarizability: 6.39225768e+01 4.14303491e-01 3.77429500e+01 -8.75739530e+00 5.16809875e-02 2.80973647e+01
1716.lowfreq: -0.0007 -0.0004 -0.0004 6.3450 13.4720 17.0609 38.2931 148.9600 418.8435
frequency: 38.2049 148.9585 418.8434 463.7386 609.9147 701.6690 828.8063 857.1182 1128.1127 1194.3219 1248.1657 1398.4793 1426.2663 3094.4593 3206.4394
redmass: 7.0851 15.8889 2.8509 7.9973 8.0489 7.4755 11.2200 1.4368 1.1976 2.9707 1.6502 1.0847 6.7957 1.0522 1.1165
irintensity: 2.0487 2.0511 0.4385 12.3418 22.9039 1.7436 16.4723 2.3751 37.5484 66.6716 51.1050 7.6162 146.8648 2.3641 1.5969
temp: 298.150 k
press: 1.00000 atm
elementType: 53 8 8 7 6 1 1
symmnumber: 1
zpe: 100268.0 jmol-1
zpe.correction: 0.038190 hartree
zpe.thermalcorrener: 0.043539 hartree
zpe.thermalcorrenthalpy: 0.044484 hartree
zpe.thermalcorrgfe: 0.006305 hartree
zpe.sumelectzpe: -255.512914 hartree
zpe.sumelectthermal: -255.507565 hartree
zpe.sumelectthermalent: -255.506621 hartree
zpe.sumelectthermalfe: -255.544799 hartree
dipole: 2.1724 -0.0731 2.6117
dipole: 3.3979
quadrupole: -49.2990 -46.7818 -39.9266
quadrupole: 0.1148 -5.9384 -0.1196
quadrupole: -3.9632 -1.4460 5.4092 0.1148 -5.9384 -0.1196
hfenergy: -255.5511044 hartree
pointgroup: C01 [X(C1H2I1N1O2)]
dipole: -0.9713019 0.0599235 0.9165737 debye
dipolederiv: -0.1484181 0.0000721 -0.0332575 -0.0024124 0.0249635 -0.0024157 -0.0740535 -0.0017907 -0.0289843 -0.4713615 -0.1751384 0.1068202 -0.043709 -0.716346 0.0127391 0.2185185 0.1183017 -0.2357832 -0.4641366 0.1722732 0.0939945 0.0552993 -0.7323967 0.0232735 0.2081177 -0.0846754 -0.228493 0.8753049 -0.004825 -0.3308677 -0.0275853 1.250872 -0.0375343 -0.6737057 -0.0329506 0.1935247 0.242796 0.0149183 0.3349085 0.0147467 0.0442644 0.0048989 0.3175115 0.0044485 0.2356825 -0.0189429 -0.0630957 -0.0832172 0.000984 0.0606427 -0.0521777 0.0009871 -0.0378997 0.0367403 -0.0152418 0.0557955 -0.088381 0.0026765 0.068 0.0512162 0.0026245 0.0345663 0.027313 unknown
polarizability: 61.332761|0.5877211|37.728387|12.7522282|-0.2786538|30.7017435 unknown
InChI: InChI=1S/CH2INO2/c2-1-3(4)5/h1H2
charge 0 multiplicity 1
7 atoms
I  -2.366474 0.007316 -0.421507
O  1.201141 1.119509 -0.287297
O  1.155664 -1.16793 -0.195046
N  0.682226 -0.002151 0.066437
C  -0.603448 0.057294 0.878351
H  -0.620416 1.0114 1.417993
H  -0.642892 -0.832038 1.51837
