program: Gaussian 09
title: 000117508
version: EM64L-G09RevD.01
frameworkgroup: C1[X(C10H20N2O4)]
method: RPBEPBE
basis: SDD
operation: Freq
keyword: #p
keyword: freq=noraman
keyword: PBEPBE/SDD
title: #p freq=noraman PBEPBE/SDD
converged: YES YES NO NO
title: Mulliken charges:
elementType: O O O O N N C C C C C C C C C C H H H H H H H H H H H H H H H H H H H H
charge: -0.304824 -0.302336 -0.289735 -0.283814 -0.615147 -0.617392 -0.028330 -0.407045 -0.389493 -0.355275 -0.369455 -0.327851 -0.357896 -0.698858 0.309027 0.291952 0.208899 0.207882 0.209825 0.235993 0.177043 0.193878 0.181403 0.262184 0.217022 0.210352 0.259131 0.190633 0.204173 0.211363 0.207491 0.214049 0.340499 0.339512 0.339656 0.335484
chargesum: 0.00000
title: Mulliken charges with hydrogens summed into heavy atoms:
elementType: O O O O N N C C C C C C C C C C
charge: -0.304824 -0.302336 -0.289735 -0.283814 0.064864 0.057748 0.180569 0.010662 0.023543 0.020006 0.109751 0.141632 0.036910 -0.065955 0.309027 0.291952
polarizability: 1.42778216e+02 5.65910500e+00 1.37686985e+02 -2.08587713e-01 6.44080305e+00 1.23878858e+02
1716.lowfreq: -6.1241 -0.0008 -0.0008 -0.0004 3.9361 9.2279 15.5350 24.6655 28.2099
frequency: 14.7307 24.6150 28.1082 36.3729 47.9332 54.3772 73.3955 87.6195 99.5370 121.8657 136.3140 174.5309 206.6219 229.0722 233.2091 263.1603 286.1854 334.3746 377.3943 400.5971 432.2781 481.3934 490.3183 497.1373 500.8176 521.4321 521.8147 587.4997 606.1792 626.0707 697.8609 698.7898 726.8570 753.8259 772.4011 805.7090 820.9489 857.5915 896.4501 919.6501 947.8746 966.9099 1002.9663 1008.7198 1025.1237 1056.6542 1057.8120 1060.9285 1073.1656 1092.2858 1103.4197 1149.0918 1150.1464 1198.7339 1221.8276 1248.0044 1249.9025 1257.3890 1284.3717 1289.9817 1293.1195 1304.1177 1304.9738 1315.2488 1338.5775 1353.7956 1365.8055 1367.5698 1380.7406 1387.5854 1463.0740 1465.2737 1468.5187 1472.0138 1474.2646 1477.1408 1480.9831 1487.8707 1586.9473 1588.1727 1685.5580 1689.2855 2951.3705 2955.5725 2963.5206 2967.1001 2970.3646 2979.5384 2994.1234 3009.5658 3014.2297 3018.8964 3027.1421 3048.0089 3067.1174 3069.0848 3086.4017 3088.6459 3558.1201 3559.1428 3716.3592 3717.9336
redmass: 7.4263 3.7783 5.5132 3.2686 2.6744 3.8605 4.1139 3.3055 4.1683 2.1043 2.5398 6.1069 3.1391 5.2927 1.1414 3.6674 2.7239 3.1425 2.7326 2.8705 2.9943 2.6383 1.2250 1.1734 2.4753 1.0707 1.0871 3.4667 4.8074 4.7796 11.2602 11.3122 1.0731 1.2053 3.7493 2.8938 1.9549 1.7659 1.8042 1.6143 1.7905 1.9238 3.1203 4.4579 3.4170 2.0154 2.0583 2.6245 2.3734 1.7597 1.9624 2.7938 1.9923 1.5591 1.2520 1.1722 1.1991 1.3398 1.2403 1.3110 1.5192 1.5838 1.4819 1.6940 1.4120 1.6073 1.5768 1.5345 1.5008 1.2196 1.0754 1.0776 1.0786 1.0740 1.0893 1.0427 1.0752 1.0906 1.2053 1.2131 7.0983 7.3338 1.0596 1.0626 1.0803 1.0588 1.0377 1.0611 1.0951 1.0589 1.0951 1.0619 1.1024 1.1030 1.1005 1.0995 1.1058 1.1065 1.0446 1.0445 1.1058 1.1057
irintensity: 1.6800 0.1692 0.9754 5.8576 4.0166 5.2491 1.3052 0.2210 6.8063 0.2342 1.5458 8.1965 1.4828 6.9163 0.0581 3.8586 12.7084 18.3396 1.2362 4.4268 7.9982 6.9428 236.1913 305.6195 49.2121 60.5816 13.5592 3.8110 1.6262 3.5851 22.7347 48.7296 11.4442 2.8579 12.1165 22.1752 15.4666 6.3365 8.2724 6.1513 0.5286 60.1937 150.9841 61.5883 77.6472 24.7396 5.4590 7.1417 8.6859 17.1056 22.0292 16.5308 1.9498 1.3300 8.3767 0.6089 3.4263 5.7443 35.7387 154.6048 214.6779 117.7527 67.0055 99.8222 2.5654 9.9598 2.6012 82.7556 28.3611 11.9585 0.2264 12.7919 15.2712 2.7989 17.3676 11.9158 2.0535 21.7366 132.5453 65.3678 233.4418 462.4299 4.5197 14.8209 10.7301 67.7997 32.1813 51.4420 8.3710 32.6476 10.6535 60.5236 2.7306 68.0967 90.2676 62.4920 6.8172 19.4677 69.8883 58.2289 50.9158 48.4557
temp: 298.150 k
press: 1.00000 atm
elementType: 8 8 8 8 7 7 6 6 6 6 6 6 6 6 6 6 1 1 1 1 1 1 1 1 1 1 1 1 1 1 1 1 1 1 1 1
symmnumber: 1
zpe: 797928.5 jmol-1
zpe.correction: 0.303915 hartree
zpe.thermalcorrener: 0.323263 hartree
zpe.thermalcorrenthalpy: 0.324207 hartree
zpe.thermalcorrgfe: 0.251950 hartree
zpe.sumelectzpe: -802.204581 hartree
zpe.sumelectthermal: -802.185233 hartree
zpe.sumelectthermalent: -802.184289 hartree
zpe.sumelectthermalfe: -802.256546 hartree
dipole: -1.8813 -0.7263 -0.5576
dipole: 2.0922
quadrupole: -100.8029 -80.1459 -93.5703
quadrupole: 7.1552 8.5714 8.6199
quadrupole: -9.2965 11.3605 -2.0640 7.1552 8.5714 8.6199
hfenergy: -802.508496 hartree
pointgroup: C01 [X(C10H20N2O4)]
dipole: -0.7022155 -0.3626876 -0.2300687 debye
polarizability: 141.5400948|5.9808103|138.9209778|-0.6328108|6.4973144|123.8829858 unknown
InChI: InChI=1S/C10H20N2O4/c1-2-3-4-5-8(6-15-9(11)13)7-16-10(12)14/h8H,2-7,11-12H2,1H3
charge 0 multiplicity 1
36 atoms
O  -0.309659 2.430475 -0.104662
O  -2.567832 -1.266372 -0.677723
O  2.038663 2.701812 0.016313
O  -3.051215 -1.216892 1.640782
N  0.58455 3.572164 1.640142
N  -3.442164 -3.111089 0.311431
C  -0.594068 0.162768 -1.0894
C  0.338572 -0.584015 -0.10317
C  1.782166 -0.787559 -0.61736
C  2.638669 -1.646443 0.340769
C  -0.171839 1.622989 -1.347044
C  -2.065363 0.129451 -0.629048
C  4.084352 -1.857331 -0.164089
C  4.942127 -2.706324 0.798986
C  0.887203 2.887919 0.484604
C  -3.026768 -1.816172 0.537518
H  -0.539061 -0.344402 -2.077544
H  -0.109353 -1.575215 0.107094
H  0.358013 -0.04071 0.86307
H  2.277129 0.193953 -0.751148
H  1.751642 -1.275986 -1.614984
H  2.668961 -1.160159 1.338159
H  2.153721 -2.634331 0.490216
H  0.873035 1.690456 -1.694656
H  -0.841237 2.108857 -2.079259
H  -2.710597 0.706119 -1.316607
H  -2.178774 0.515614 0.398877
H  4.054434 -2.343285 -1.161138
H  4.562178 -0.868152 -0.314461
H  5.017152 -2.223076 1.791554
H  4.497322 -3.708707 0.947871
H  5.96888 -2.845791 0.412906
H  1.343798 3.973077 2.18282
H  -0.380468 3.659012 1.949571
H  -3.807584 -3.648515 1.091902
H  -3.390987 -3.513238 -0.621193
