program: Gaussian 09
title: 000117485
version: EM64L-G09RevD.01
frameworkgroup: C1[X(C13H4ClF15O2S)]
method: RPBEPBE
basis: SDD
operation: Freq
keyword: #p
keyword: freq=noraman
keyword: PBEPBE/SDD
title: #p freq=noraman PBEPBE/SDD
converged: YES YES NO NO
title: Mulliken charges:
elementType: Cl S F F F F F F F F F F F F F F F O O C C C C C C C C C C C C C H H H H
charge: -0.180170 0.898869 -0.119469 -0.126417 -0.121044 -0.134633 -0.139541 -0.119462 -0.117045 -0.117710 -0.153185 -0.145976 -0.120192 -0.121671 -0.119172 -0.125712 -0.122559 -0.446426 -0.445632 0.233260 0.253263 0.264295 0.252701 0.148939 0.209364 0.297157 0.374061 -0.299393 -0.318030 -0.201514 -0.206971 -0.094906 0.283351 0.285200 0.297719 0.298655
chargesum: 0.00000
title: Mulliken charges with hydrogens summed into heavy atoms:
elementType: Cl S F F F F F F F F F F F F F F F O O C C C C C C C C C C C C C
charge: -0.180170 0.898869 -0.119469 -0.126417 -0.121044 -0.134633 -0.139541 -0.119462 -0.117045 -0.117710 -0.153185 -0.145976 -0.120192 -0.121671 -0.119172 -0.125712 -0.122559 -0.446426 -0.445632 0.233260 0.253263 0.264295 0.252701 0.148939 0.209364 0.297157 0.374061 -0.016042 -0.032831 0.096205 0.091684 -0.094906
polarizability: 2.38713113e+02 -2.31235441e+01 1.78747952e+02 -6.55224735e+00 -4.37069593e+00 1.66946360e+02
1716.lowfreq: -2.3524 -0.0019 -0.0014 -0.0013 3.6796 4.4702 12.5478 20.1595 22.7350
frequency: 11.7979 20.0500 22.6599 36.7984 41.0991 48.3380 60.3014 67.8161 76.4261 95.6130 103.7756 117.7897 127.8390 130.2773 133.2263 148.7066 168.1621 176.0179 189.2478 197.6310 205.8231 213.5849 232.5732 235.4852 246.5772 249.0641 256.9624 268.9640 278.8149 288.1880 289.6009 299.8437 304.1135 310.1071 317.0721 322.6429 331.0505 348.5542 351.0018 378.5333 403.3791 406.4254 414.4208 422.4745 442.7893 453.2558 462.3675 470.1660 510.6621 516.1559 552.7447 557.9217 573.5920 584.1998 588.3275 592.2126 612.9788 654.3366 681.7656 728.2926 804.1800 826.3359 838.5907 846.1232 859.8769 903.2205 949.3032 963.5602 967.0620 975.3809 980.0498 989.9677 992.9208 1003.5487 1020.2131 1028.4829 1031.0742 1036.6360 1043.7170 1048.0042 1050.7787 1077.2145 1085.7799 1110.5203 1121.7844 1131.6895 1136.2218 1142.1426 1156.4365 1188.7222 1197.4132 1247.0512 1303.9891 1387.8504 1395.0188 1468.8723 1593.2318 1596.3112 3165.9051 3167.2214 3184.8482 3193.0287
redmass: 19.5163 18.9621 17.1734 15.2225 12.4402 17.8841 5.2419 13.5115 14.5235 15.2275 13.0011 15.6637 14.0203 16.3928 16.3278 15.9243 16.4449 16.4842 13.9620 14.0120 12.7423 17.0543 17.6929 19.5777 18.4308 17.9725 15.6501 16.1477 17.5840 16.6232 18.4604 16.8726 17.4767 12.7082 18.5668 13.2871 18.4771 9.9185 10.7594 12.8759 3.0172 15.1127 11.2534 17.0630 15.6351 12.5468 15.9303 9.2977 7.5511 9.7976 15.9114 14.5384 15.3129 9.0541 16.3781 11.0160 7.1318 17.0880 7.0658 4.2952 9.8723 16.8554 2.0235 1.3600 3.5281 8.6841 10.2414 15.6218 10.1750 1.4582 10.8717 3.4607 1.8843 7.6155 10.7480 12.5699 12.1047 10.7433 12.6345 11.3477 2.2708 12.9859 13.0545 11.7993 4.6930 4.4211 2.2292 12.0637 11.9630 12.2966 1.1285 4.9857 1.2550 8.3931 3.0478 2.2279 6.2238 7.1459 1.0901 1.0911 1.0969 1.0958
irintensity: 0.1276 0.0927 0.3008 0.0080 0.6822 0.3043 0.2642 1.1067 0.7151 0.3731 5.2470 1.0524 2.1906 0.3422 1.6112 1.2179 0.3460 1.4885 19.4147 4.2502 0.0843 9.5678 1.5961 0.4345 0.5270 0.3287 0.5776 5.3307 1.9050 1.1684 0.9479 2.3946 2.4882 17.6003 0.5664 2.2051 0.6461 9.5632 20.6369 3.5076 3.1515 4.4791 41.7325 11.1755 3.6507 61.8650 8.4958 4.9495 13.8202 16.3596 10.5199 6.7191 22.6277 14.6949 2.6186 5.3905 0.1642 49.6608 27.9255 3.3088 415.0079 49.6667 26.6557 6.9658 23.5834 88.4895 131.8449 52.2342 18.3307 2.9739 4.6686 37.4156 0.5219 172.3336 82.8928 58.1094 66.4090 62.8124 109.4693 62.9622 2.2450 288.6016 289.7245 14.2996 46.7461 17.5134 30.5886 7.9943 0.6909 47.4946 1.3737 101.5963 2.1348 14.0290 24.6596 5.0523 10.9197 3.8384 4.0670 5.7740 2.3959 0.7921
temp: 298.150 k
press: 1.00000 atm
elementType: 17 16 9 9 9 9 9 9 9 9 9 9 9 9 9 9 9 8 8 6 6 6 6 6 6 6 6 6 6 6 6 6 1 1 1 1
symmnumber: 1
zpe: 433890.8 jmol-1
zpe.correction: 0.165260 hartree
zpe.thermalcorrener: 0.197193 hartree
zpe.thermalcorrenthalpy: 0.198137 hartree
zpe.thermalcorrgfe: 0.099454 hartree
zpe.sumelectzpe: -3001.356881 hartree
zpe.sumelectthermal: -3001.324948 hartree
zpe.sumelectthermalent: -3001.324004 hartree
zpe.sumelectthermalfe: -3001.422687 hartree
dipole: -2.2422 1.6408 0.3136
dipole: 2.7961
quadrupole: -235.1566 -204.4362 -195.1548
quadrupole: 15.1231 -1.0514 -3.6813
quadrupole: -23.5741 7.1463 16.4278 15.1231 -1.0514 -3.6813
hfenergy: -3001.522141 hartree
pointgroup: C01 [X(C13H4Cl1F15O2S1)]
dipole: 0.8485846 0.6902484 -0.1167414 debye
polarizability: 236.1698401|26.1274633|180.8636156|-7.0451651|4.0552728|167.3739703 unknown
InChI: InChI=1S/C13H4F15O2S.Cl/c14-7(15,5-1-3-6(4-2-5)31(29)30)8(16,17)9(18,19)10(20,21)11(22,23)12(24,25)13(26,27)28;/h1-4H;
charge 0 multiplicity 1
36 atoms
Cl -5.620895 -3.069775 0.977241
S  -6.254982 -1.056691 -0.193508
F  1.658956 -0.280952 1.904713
F  -0.341991 -0.938938 1.017208
F  1.800294 -2.043499 -0.16284
F  0.568098 -0.693573 -1.524943
F  -0.277073 1.525873 2.18834
F  1.38332 2.248435 0.798734
F  2.551402 1.255405 -1.470753
F  3.128371 -0.819179 -2.219461
F  -0.257117 1.925018 -1.419921
F  -1.076453 3.252985 0.252336
F  3.965538 0.888679 0.880165
F  5.133912 0.575511 -1.057179
F  6.081444 -1.066911 0.813395
F  4.040877 -1.811283 1.44671
F  4.845956 -2.320298 -0.617497
O  -6.607574 -1.460111 -1.718743
O  -7.294768 -0.250185 0.745609
C  0.785025 -0.100009 0.808025
C  1.511561 -0.68999 -0.466743
C  0.26693 1.390143 0.87924
C  2.836126 -0.064426 -1.057837
C  -0.847573 1.890286 -0.123904
C  4.163814 0.004722 -0.20203
C  -2.16208 1.139661 -0.137063
C  4.784019 -1.328204 0.365576
C  -3.064807 1.321662 0.940075
C  -2.489323 0.305737 -1.231595
C  -4.302948 0.647253 0.938292
C  -3.725145 -0.374323 -1.251352
C  -4.584893 -0.176355 -0.161938
H  -2.810852 1.984929 1.771123
H  -1.794648 0.191311 -2.066994
H  -5.022997 0.774158 1.751966
H  -4.009423 -1.018265 -2.088748
