program: Gaussian 09
title: 000117479
version: EM64L-G09RevD.01
frameworkgroup: C1[X(C6H15N)]
method: RPBEPBE
basis: SDD
operation: Freq
keyword: #pfreq=noraman
keyword: PBEPBE/SDD
title: #p freq=noraman PBEPBE/SDD
converged: YES YES NO NO
title: Mulliken charges:
elementType: N C C C C C C H H H H H H H H H H H H H H H
charge: -0.293872 -0.375342 -0.338891 -0.363515 -0.350978 -0.694134 -0.626203 0.175978 0.215291 0.185223 0.183263 0.205864 0.173397 0.192621 0.196426 0.215460 0.209752 0.208819 0.248513 0.187458 0.220161 0.224709
chargesum: 0.00000
title: Mulliken charges with hydrogens summed into heavy atoms:
elementType: N C C C C C C
charge: -0.045359 0.015927 0.029595 0.015746 0.038070 -0.060104 0.006125
polarizability: 9.27085419e+01 1.60007467e-02 6.62249989e+01 7.01479604e-02 7.17244569e-01 6.19690909e+01
1716.lowfreq: -13.4923 0.0007 0.0008 0.0009 8.2359 25.0125 57.8981 71.4076 96.2916
frequency: 57.5457 71.2984 96.2839 121.6623 139.4873 226.4022 227.6292 246.7587 300.5753 397.2683 481.4878 657.5419 729.4373 764.4220 849.3714 885.5215 957.5340 966.0989 1005.8119 1058.6155 1074.1044 1081.9728 1104.1537 1133.7780 1162.7120 1187.0134 1213.3203 1253.8701 1262.8019 1280.5551 1291.0183 1315.0112 1351.3957 1370.2876 1387.6939 1434.2021 1445.3984 1464.2473 1465.9829 1468.3518 1476.2187 1477.7141 1486.5999 1490.2543 1498.8347 2833.3987 2863.7965 2952.2404 2956.8567 2968.9518 2971.6761 2989.4591 2994.6455 3009.4305 3019.8600 3042.4033 3068.2569 3071.0590 3071.9593 3442.3396
redmass: 2.8016 1.5953 2.9860 2.3556 1.8093 1.1319 1.5233 1.7367 3.8972 2.7310 2.9192 1.3173 1.0693 1.1109 1.1796 1.9051 1.8609 1.1911 3.6800 2.8855 1.7494 1.6020 1.5375 2.1705 3.2942 1.8954 1.4545 1.3601 1.2387 1.0772 1.1037 1.3550 1.5715 1.4856 1.2209 1.1492 1.2098 1.0688 1.0676 1.0710 1.0440 1.0638 1.0742 1.0701 1.0736 1.0713 1.0571 1.0622 1.0617 1.0595 1.0369 1.0835 1.0970 1.0741 1.1009 1.1020 1.1008 1.0992 1.0994 1.0743
irintensity: 0.5953 1.7182 0.3763 1.3052 0.9866 0.0995 1.4970 2.2204 0.2247 10.0340 1.8956 120.5571 12.4749 0.2103 1.1263 6.5553 3.8576 3.6105 0.0057 0.9631 12.1706 12.4788 1.9921 4.4127 32.0159 0.7364 1.3760 2.0186 3.2062 0.2973 0.8591 0.0630 1.9454 5.4168 13.3455 1.6244 18.9300 8.8818 1.2686 0.7255 11.2461 7.1940 10.4204 16.2167 7.1552 94.7151 175.7246 2.8516 19.4135 84.7319 32.0662 49.2317 2.8737 51.7247 2.7096 84.1935 99.9905 52.5285 43.6553 1.8882
temp: 298.150 k
press: 1.00000 atm
elementType: 7 6 6 6 6 6 6 1 1 1 1 1 1 1 1 1 1 1 1 1 1 1
symmnumber: 1
zpe: 530391.8 jmol-1
zpe.correction: 0.202016 hartree
zpe.thermalcorrener: 0.211946 hartree
zpe.thermalcorrenthalpy: 0.212890 hartree
zpe.thermalcorrgfe: 0.166770 hartree
zpe.sumelectzpe: -291.757866 hartree
zpe.sumelectthermal: -291.747935 hartree
zpe.sumelectthermalent: -291.746991 hartree
zpe.sumelectthermalfe: -291.793111 hartree
dipole: -0.0117 -0.3177 1.0111
dipole: 1.0599
quadrupole: -45.8737 -46.8757 -46.6220
quadrupole: -1.0256 2.7191 2.1607
quadrupole: 0.5835 -0.4186 -0.1649 -1.0256 2.7191 2.1607
hfenergy: -291.9598812 hartree
pointgroup: C01 [X(C6H15N1)]
dipole: -0.0078613 0.1509992 -0.3886221 debye
dipolederiv: -0.7626546 -0.035747 0.0079692 -0.027777 -0.5021429 0.2104217 -0.0308494 0.2629806 -0.3154742 -0.1018029 0.0073999 0.0114104 -0.0285209 0.0895459 0.02034 -0.0095607 0.045296 0.1827432 -0.0453705 -0.0091859 0.0016578 -0.0441111 0.0713924 -0.001899 -0.0061268 -0.0066171 0.1877313 0.4116067 -0.1758458 0.0334533 -0.1949059 0.3189765 -0.1060433 -0.0587055 -0.1008656 0.355744 0.0415688 0.0040559 0.0022631 0.054322 0.1043983 0.00091 0.0001675 0.0012447 0.1769402 -0.0791788 0.0455547 0.001184 0.0122733 0.0520293 -0.000275 0.0006857 -0.0009649 0.0959739 0.3909119 0.161722 -0.038421 0.2483795 0.3177255 -0.1058374 0.0715118 -0.0950467 0.2816514 0.035928 0.0086248 0.0032155 0.0044626 -0.049833 -0.1216077 0.016722 -0.1515274 -0.1027721 0.059554 -0.0014836 0.0055948 -0.0038148 -0.0340403 0.1087744 0.0091339 0.12431 -0.0728513 0.0369834 -0.0020385 -0.0013434 0.0068383 -0.0498706 -0.1195405 0.0043006 -0.1436738 -0.0895107 0.0364327 -0.0039013 0.001182 0.0058963 -0.0473607 0.119355 -0.0041154 0.1447517 -0.0958777 0.0343824 0.0031061 -0.0194234 0.0268102 -0.0463194 -0.1023026 -0.0033555 -0.1287601 -0.1022743 -0.0697527 0.0256588 -0.0046933 0.0972211 -0.1369404 0.149072 -0.0596315 0.1998201 -0.1490146 0.0266365 0.0238121 0.024953 -0.0013782 -0.0498213 -0.1245992 0.0025274 -0.1538976 -0.0919221 0.0270497 0.024897 -0.0256667 -0.0023246 -0.0444338 0.1223538 -0.0021254 0.1506395 -0.0915446 -0.1760415 -0.101788 0.0023554 -0.1383506 0.0005536 0.0012387 0.0021439 0.0012858 0.0995119 0.0784563 0.0006903 -0.0211351 0.0492685 -0.019173 -0.1240891 0.0269849 -0.1393471 -0.0886459 0.0781591 0.0024474 0.019192 0.0499512 -0.0161607 0.1230637 -0.0293083 0.139212 -0.0930327 0.0998187 -0.0276156 -0.0318274 0.0105321 0.1868967 -0.1068722 -0.0204444 -0.2285842 0.060033 -0.0492964 -0.0383929 -0.0006877 -0.1872409 -0.1239561 0.1732538 0.1023432 0.1935447 -0.1385929 -0.1494111 0.0935978 0.0052939 0.1490248 -0.0197764 -0.0056957 0.0292193 0.0092341 0.108574 0.0760202 -0.005568 0.0234737 -0.086556 -0.0016896 -0.1100211 -0.041517 -0.1230345 -0.11739 unknown
polarizability: 92.7056617|0.1560342|66.1126446|-0.2614538|0.9902838|62.0843254 unknown
InChI: InChI=1S/C6H15N/c1-3-4-5-6-7-2/h7H,3-6H2,1-2H3
charge 0 multiplicity 1
22 atoms
N  2.52242 -0.431066 -0.019439
C  0.032164 -0.459702 -0.005312
C  -1.268755 0.373498 -0.010557
C  1.305678 0.407734 -0.017069
C  -2.546387 -0.496911 -0.000159
C  -3.844159 0.339493 0.000175
C  3.789549 0.321937 -0.010748
H  0.03763 -1.131066 -0.891368
H  0.061821 -1.115338 0.886595
H  -1.279267 1.045661 0.872994
H  -1.284844 1.033681 -0.90323
H  1.329145 1.038874 0.894646
H  1.264098 1.113138 -0.888916
H  -2.536779 -1.167586 -0.883768
H  -2.528888 -1.157341 0.89063
H  -4.742603 -0.304809 0.008905
H  -3.890835 0.997043 0.888887
H  -3.899457 0.985236 -0.896737
H  2.492142 -1.127434 -0.776499
H  3.903676 1.047483 -0.855006
H  4.641961 -0.379955 -0.043331
H  3.869188 0.89793 0.930406
