program: Gaussian 09
title: 000117481
version: EM64L-G09RevD.01
frameworkgroup: C1[X(C14H31NO3S)]
method: RPBEPBE
basis: SDD
operation: Freq
keyword: #p
keyword: freq=noraman
keyword: PBEPBE/SDD
title: #p freq=noraman PBEPBE/SDD
converged: YES YES NO NO
title: Mulliken charges:
elementType: S O O O N C C C C C C C C C C C C C C H H H H H H H H H H H H H H H H H H H H H H H H H H H H H H H
charge: 0.969550 -0.407683 -0.591312 -0.561332 -0.289554 -0.386146 -0.384774 -0.384519 -0.382151 -0.382287 -0.371484 -0.372651 -0.398296 -0.353437 -0.371912 -0.356653 -0.696561 -0.323923 -0.352017 0.193885 0.194188 0.193301 0.194056 0.193163 0.193117 0.195589 0.192745 0.192197 0.191979 0.192031 0.190236 0.189418 0.189290 0.183334 0.219845 0.187736 0.187594 0.215529 0.182708 0.194684 0.194799 0.250914 0.209698 0.209622 0.215078 0.233195 0.149461 0.241556 0.259101 0.367094
chargesum: 0.00000
title: Mulliken charges with hydrogens summed into heavy atoms:
elementType: S O O O N C C C C C C C C C C C C C C
charge: 0.969550 -0.407683 -0.224218 -0.561332 -0.038640 0.001927 0.002583 0.001761 0.006183 0.001889 0.010782 0.006057 0.004883 0.021893 0.026325 0.032830 -0.062162 0.058733 0.148640
polarizability: 2.69667347e+02 1.01233641e+01 1.71931658e+02 5.11192393e+00 -2.75309431e+00 1.62405156e+02
1716.lowfreq: -8.8585 -0.0012 0.0005 0.0021 4.2107 6.7003 10.1151 20.2494 21.3320
frequency: 3.6914 20.2072 20.7015 25.9996 36.7259 44.1869 53.0360 59.3310 68.9710 82.0109 88.4733 101.0473 115.0391 117.9403 134.0976 137.4915 140.9034 148.8955 152.3781 156.6481 170.9437 218.4933 231.5571 239.7988 264.2167 275.1970 313.7942 316.9822 366.5692 380.4908 438.8135 445.7920 452.5817 492.4403 500.9570 536.8419 540.6215 669.8384 719.1356 721.0397 726.1996 737.9391 759.5532 789.2362 794.8247 836.4283 886.3675 888.2252 899.2564 913.8260 939.1854 977.1176 985.6827 988.2143 1003.6270 1024.7851 1028.3991 1030.4414 1043.4118 1054.3736 1060.2794 1072.9229 1075.5777 1080.3521 1082.2343 1083.4240 1104.2298 1125.8470 1154.8297 1160.7174 1181.0991 1196.2591 1203.5581 1215.7472 1230.8259 1236.5239 1254.0776 1258.5073 1268.7369 1275.4383 1277.9706 1281.4639 1285.8943 1288.4609 1290.9017 1296.7946 1297.4116 1304.3726 1318.5291 1336.0226 1349.4805 1353.6890 1356.3926 1357.7076 1361.4114 1387.9224 1390.2473 1442.2766 1458.4830 1458.5889 1461.3217 1461.9062 1462.0664 1464.5919 1466.8980 1471.2628 1474.9205 1476.7206 1477.7504 1482.1164 1486.0194 1488.4892 1494.5599 2801.8894 2855.3215 2948.5412 2948.6447 2950.3127 2950.9712 2952.6097 2954.5891 2957.4566 2961.3139 2965.3089 2966.7236 2967.9457 2971.4962 2981.5989 2984.5049 2988.9499 2995.0311 2997.7448 3003.0749 3013.0122 3023.2623 3032.6822 3035.9692 3040.5863 3046.4055 3068.1855 3070.3457 3077.6937 3437.1762 3439.1073
redmass: 4.1355 4.8168 3.9748 2.3473 3.4249 4.1428 2.1808 2.4509 4.6391 2.1197 2.3599 3.0700 2.0207 2.5173 2.9744 2.1437 2.3071 2.0255 2.1367 2.2642 3.1757 3.6651 1.1113 3.3936 4.2681 4.0302 3.0001 4.3535 4.7555 3.2250 4.0949 3.2851 5.3402 3.6146 3.0914 5.6028 8.4767 1.2812 1.0582 1.0665 1.0803 1.1022 1.1334 1.1609 1.1697 1.2120 1.3872 1.6168 10.4594 8.3314 1.2143 5.0274 4.4880 1.1967 3.6497 2.8171 1.3138 2.4167 1.2867 2.9336 3.1980 1.9998 2.5790 1.9951 2.1608 2.1530 2.0435 3.0332 2.1548 2.2107 1.8477 1.4194 1.3749 1.4148 1.3530 1.3519 1.2899 1.2721 1.1946 1.1550 1.0539 1.0703 1.2269 1.1012 1.1142 1.1046 1.1177 1.2502 1.3204 1.3881 1.4542 1.7025 1.5942 1.6069 1.4642 1.2174 1.4482 1.0794 1.0748 1.0733 1.1670 1.0732 1.1070 1.0695 1.0790 1.0836 1.0869 1.0431 1.0862 1.0888 1.0923 1.0925 1.0895 1.0709 1.0711 1.0585 1.0585 1.0589 1.0591 1.0592 1.0604 1.0614 1.0603 1.0596 1.0652 1.0586 1.0364 1.0960 1.0969 1.0982 1.0992 1.0858 1.1020 1.1035 1.1042 1.1044 1.0853 1.1042 1.1035 1.1007 1.0993 1.0984 1.0680 1.0721
irintensity: 0.1107 0.3219 0.1976 0.0190 0.5380 0.5553 0.1732 0.4760 0.1183 0.3177 1.3466 0.1079 0.5585 2.3241 3.5274 8.7302 9.5178 22.9863 0.1713 1.3026 2.7701 1.0251 0.0060 10.7047 19.1208 37.1527 57.5219 23.7984 16.5345 6.8518 8.3971 10.5123 69.9374 14.0554 8.1907 38.1308 87.9814 107.3387 19.1160 0.3270 7.7833 0.2676 2.3191 1.5362 0.8071 0.9593 1.1693 5.3772 68.0420 33.3736 0.5922 1.3706 1.4259 1.1145 4.5629 11.4631 1.6630 6.1050 52.7248 1.0837 2.8857 2.1113 0.3283 1.3256 0.8860 0.7784 35.1714 2.4155 68.5203 21.3642 0.8337 13.8626 9.2824 0.3523 0.3359 0.2474 1.1929 0.5830 1.3139 1.3098 0.0033 0.2201 1.7371 1.0728 0.1433 0.3004 0.0413 9.4795 4.1973 0.8035 1.9674 0.2308 0.6065 0.6513 8.6582 11.1114 2.7915 13.6213 0.2069 0.0389 23.0921 0.3267 13.9228 1.6431 1.5468 4.0724 3.0561 12.2854 2.1835 0.9715 3.0564 32.6828 10.0646 188.5379 103.2472 0.0126 0.0312 0.0481 0.8136 0.2408 1.0087 4.7803 3.8038 116.9955 15.0057 233.0051 37.8893 0.1196 0.3034 0.5732 2.3035 31.5663 0.0276 0.2351 1.5269 3.9326 19.3823 74.5964 283.4991 98.4245 55.4508 8.2883 26.2459 6.4110
temp: 298.150 k
press: 1.00000 atm
elementType: 16 8 8 8 7 6 6 6 6 6 6 6 6 6 6 6 6 6 6 1 1 1 1 1 1 1 1 1 1 1 1 1 1 1 1 1 1 1 1 1 1 1 1 1 1 1 1 1 1 1
symmnumber: 1
zpe: 1142931.7 jmol-1
zpe.correction: 0.435320 hartree
zpe.thermalcorrener: 0.461795 hartree
zpe.thermalcorrenthalpy: 0.462739 hartree
zpe.thermalcorrgfe: 0.371424 hartree
zpe.sumelectzpe: -1228.857059 hartree
zpe.sumelectthermal: -1228.830583 hartree
zpe.sumelectthermalent: -1228.829639 hartree
zpe.sumelectthermalfe: -1228.920954 hartree
dipole: -2.9198 0.1575 0.0793
dipole: 2.9251
quadrupole: -159.4751 -130.1389 -132.4195
quadrupole: -3.6809 -0.0272 1.4277
quadrupole: -18.7973 10.5389 8.2584 -3.6809 -0.0272 1.4277
hfenergy: -1229.2923783 hartree
pointgroup: C01 [X(C14H31N1O3S1)]
dipole: -1.1494496 -0.0076293 -0.0559064 debye
polarizability: 269.3984439|-1.7499391|168.1224187|-12.3623068|5.4616681|166.4832985 unknown
InChI: InChI=1S/C14H31NO3S/c1-2-3-4-5-6-7-8-9-10-11-12-15-13-14-18-19(16)17/h15-16H,2-14H2,1H3
charge 0 multiplicity 1
50 atoms
S  8.878028 0.13795 -0.571027
O  7.836714 -0.352574 0.911534
O  8.393775 -1.162101 -1.78196
O  8.220214 1.523705 -1.082364
N  4.141217 0.266832 0.499224
C  -3.505521 0.367921 0.180348
C  -2.210344 -0.425575 -0.103574
C  -4.790173 -0.400374 -0.204041
C  -0.925265 0.337575 0.289241
C  -6.086586 0.391844 0.078089
C  0.36786 -0.456396 -0.002559
C  -7.370896 -0.380917 -0.298985
C  1.651047 0.302813 0.402734
C  -8.668305 0.409516 -0.01616
C  2.935178 -0.492267 0.099344
C  -9.95231 -0.36682 -0.388697
C  -11.243762 0.429662 -0.102337
C  5.425475 -0.407085 0.269443
C  6.544058 0.357657 1.001462
H  -3.475038 1.330103 -0.37273
H  -3.545109 0.630853 1.258328
H  -2.168391 -0.683293 -1.182787
H  -2.244612 -1.39039 0.444639
H  -4.820797 -1.361797 0.35041
H  -4.750257 -0.665085 -1.281644
H  -0.964469 0.589891 1.369488
H  -0.8930 1.30472 -0.254927
H  -6.059222 1.351054 -0.480319
H  -6.124296 0.66085 1.154688
H  0.329878 -1.426165 0.536255
H  0.408452 -0.702385 -1.084433
H  -7.333717 -0.650097 -1.37563
H  -7.39761 -1.340133 0.25958
H  1.684176 1.274512 -0.135426
H  1.627782 0.540325 1.484025
H  -8.645429 1.367314 -0.577324
H  -8.705604 0.681556 1.059749
H  2.925667 -1.441526 0.671092
H  2.945177 -0.771595 -0.985233
H  -9.914345 -0.638044 -1.463721
H  -9.974127 -1.323626 0.172129
H  4.129518 1.224939 0.122959
H  -11.321818 0.684867 0.971533
H  -11.25902 1.377574 -0.672985
H  -12.146274 -0.14591 -0.379344
H  5.366342 -1.432731 0.677955
H  5.690226 -0.509263 -0.818424
H  6.649222 1.388762 0.600788
H  6.335162 0.411929 2.083709
H  7.449328 -1.002877 -2.081217
