program: Gaussian 09
title: 000015124
version: EM64L-G09RevD.01
frameworkgroup: C1[X(C12H16N2O)]
method: RPBEPBE
basis: SDD
operation: Freq
keyword: #p
keyword: freq=noraman
keyword: PBEPBE/SDD
title: #p freq=noraman PBEPBE/SDD
converged: YES YES NO NO
title: Mulliken charges:
elementType: O N N C C C C C C C C C C C C H H H H H H H H H H H H H H H H
charge: -0.443889 -0.075402 -0.415452 -0.562656 0.417328 0.094777 -0.355785 0.275674 -0.455783 -0.393122 -0.493126 -0.422600 0.326457 -0.615462 -0.621871 0.224344 0.213848 0.226621 0.189759 0.269359 0.304108 0.231712 0.251185 0.210394 0.226282 0.186077 0.220543 0.220414 0.182850 0.233512 0.349903
chargesum: 0.00000
title: Mulliken charges with hydrogens summed into heavy atoms:
elementType: O N N C C C C C C C C C C C C
charge: -0.093986 -0.075402 -0.111343 -0.124464 0.417328 0.094777 0.060595 0.275674 -0.186424 -0.161410 -0.241941 -0.212207 0.326457 0.017441 0.014905
polarizability: 1.92335204e+02 -1.44034941e+01 1.63852889e+02 1.05996894e+01 5.58522933e+00 8.95052350e+01
1716.lowfreq: -9.4343 -3.7759 -0.0008 -0.0007 0.0004 8.1069 34.6149 42.0530 56.4215
frequency: 34.3476 41.2166 56.3961 112.5611 130.4605 192.6949 206.2020 221.8549 239.2944 249.2775 286.8715 311.7630 329.8506 349.1086 367.1044 420.2190 431.7997 446.4201 472.0583 473.7343 506.6824 596.9726 614.0654 623.6000 688.3294 746.7471 751.4326 777.5664 785.1138 790.0178 808.0484 835.8175 845.2425 915.0782 935.5378 1009.2112 1016.4695 1033.9801 1058.0578 1067.1625 1088.6156 1091.9892 1126.7683 1131.2261 1145.9485 1160.2114 1188.0107 1220.1254 1235.6701 1260.8763 1261.2108 1292.6441 1296.2074 1311.8082 1347.3778 1366.3197 1389.3058 1411.6414 1418.4627 1441.6014 1460.5038 1463.0390 1467.0698 1474.0824 1476.0065 1479.6920 1486.7006 1511.7233 1570.1920 1593.3092 1647.5264 2834.5326 2837.6819 2859.7539 2981.1825 3017.4810 3022.5316 3028.5676 3052.8316 3076.6870 3085.8388 3111.5858 3144.1274 3164.3925 3221.4242 3589.5569 3615.9599
redmass: 3.4597 2.9907 4.4574 2.0981 5.1642 2.8024 3.5067 1.7570 1.4966 1.2554 4.1945 1.1336 2.5502 4.4371 3.4288 3.0517 2.7211 2.7205 3.6987 5.4385 1.1428 4.2955 3.7462 3.1522 4.6544 2.9233 4.5637 1.4540 1.6472 1.8741 2.6889 4.2587 1.5752 1.3398 3.1481 2.3219 2.0921 1.6776 2.5529 3.0240 1.5877 1.3206 1.3294 1.4379 1.4591 1.6682 1.4282 1.7713 2.2213 2.5362 1.5930 1.2392 2.1580 1.8761 1.8600 1.3711 4.6911 2.6140 1.1461 1.1625 1.0839 1.0559 4.8148 1.0742 1.0606 1.0757 1.0618 3.6831 6.6179 6.0789 7.1848 1.0661 1.0605 1.0589 1.0624 1.0722 1.0849 1.0726 1.1001 1.1010 1.1002 1.0876 1.0959 1.0929 1.0983 1.0660 1.0808
irintensity: 0.2738 0.5027 0.1684 1.1750 0.6759 2.5751 4.8251 1.8823 1.8441 0.4064 7.5557 138.9306 4.0656 14.3337 5.7936 1.6683 3.5738 0.7192 0.1994 3.9877 121.3688 3.4233 11.3073 2.0204 1.2119 1.6989 0.3571 1.5876 75.7484 16.4299 23.7999 8.6641 34.5176 0.5080 45.2751 11.7339 6.1087 24.7832 43.7446 1.2463 61.4349 6.0974 10.1268 157.0956 33.7790 7.3653 20.7146 8.6571 25.1234 8.9763 34.6930 2.0795 21.9340 28.8619 13.5879 10.0703 31.4123 46.8560 3.4640 2.4714 5.9148 20.6622 4.9503 3.0534 13.8762 15.3787 24.9831 16.3302 19.7391 12.2567 76.3265 67.7949 81.2332 202.2693 28.1222 47.1003 32.6636 38.9080 31.1858 35.8487 48.9572 18.0769 18.8486 4.2703 1.0812 42.6554 57.4852
temp: 298.150 k
press: 1.00000 atm
elementType: 8 7 7 6 6 6 6 6 6 6 6 6 6 6 6 1 1 1 1 1 1 1 1 1 1 1 1 1 1 1 1
symmnumber: 1
zpe: 677315.9 jmol-1
zpe.correction: 0.257976 hartree
zpe.thermalcorrener: 0.272687 hartree
zpe.thermalcorrenthalpy: 0.273631 hartree
zpe.thermalcorrgfe: 0.215827 hartree
zpe.sumelectzpe: -650.466314 hartree
zpe.sumelectthermal: -650.451603 hartree
zpe.sumelectthermalent: -650.450659 hartree
zpe.sumelectthermalfe: -650.508463 hartree
dipole: -0.4572 -0.1403 0.2591
dipole: 0.5439
quadrupole: -93.2274 -70.9468 -93.5034
quadrupole: 3.4105 -0.5908 3.4557
quadrupole: -7.3348 14.9457 -7.6109 3.4105 -0.5908 3.4557
hfenergy: -650.7242898 hartree
pointgroup: C01 [X(C12H16N2O1)]
dipole: -0.1793337 0.0558671 -0.1025185 debye
polarizability: 192.9881386|12.7071916|163.2642689|-12.7861381|1.5111368|89.4409197 unknown
InChI: InChI=1S/C12H16N2O/c1-14(2)6-5-9-8-13-12-7-10(15)3-4-11(9)12/h3-4,7-8,13,15H,5-6H2,1-2H3
charge 0 multiplicity 1
31 atoms
O  4.58769 1.35942 -0.535179
N  -3.991374 0.399596 -0.110257
N  1.361057 -2.346341 -0.067025
C  -1.850004 -0.598385 0.79924
C  -0.447611 -1.037655 0.454006
C  0.712411 -0.180758 0.246661
C  -2.568557 0.090303 -0.39165
C  1.830707 -1.031038 -0.078712
C  -0.010273 -2.34546 0.254953
C  0.925351 1.220397 0.31133
C  3.123877 -0.530742 -0.340784
C  2.208694 1.738301 0.055533
C  3.291108 0.864708 -0.26917
C  -4.729002 0.742899 -1.344137
C  -4.170037 1.432938 0.930043
H  -2.464071 -1.465575 1.104717
H  -1.816271 0.092184 1.664869
H  -2.53744 -0.59949 -1.255743
H  -1.997035 1.008081 -0.690903
H  -0.570331 -3.276542 0.322644
H  1.922212 -3.174336 -0.251107
H  0.103105 1.899904 0.560711
H  3.977332 -1.167728 -0.589825
H  2.383874 2.821266 0.103919
H  -4.640685 -0.082829 -2.072535
H  -4.360425 1.679288 -1.837093
H  -5.800555 0.880597 -1.111639
H  -5.248715 1.599932 1.100297
H  -3.706575 2.416686 0.655086
H  -3.728587 1.100989 1.884697
H  4.601533 2.345092 -0.458448
