program: Gaussian 09
title: 000117475
version: EM64L-G09RevD.01
frameworkgroup: C1[X(C7H7N3O2)]
method: RPBEPBE
basis: SDD
operation: Freq
keyword: #pfreq=noraman
keyword: PBEPBE/SDD
title: #p freq=noraman PBEPBE/SDD
converged: NO YES NO NO
title: Mulliken charges:
elementType: O O N N N C C C C C C C H H H H H H H
charge: -0.210288 -0.205375 0.025141 -0.657805 -0.377619 0.369405 0.391909 -0.303300 -0.329737 -0.385622 -0.359817 0.096444 0.203383 0.305815 0.286389 0.287795 0.323046 0.317058 0.223179
chargesum: 0.00000
title: Mulliken charges with hydrogens summed into heavy atoms:
elementType: O O N N N C C C C C C C
charge: -0.210288 -0.205375 0.025141 -0.017700 -0.154440 0.369405 0.391909 -0.099918 -0.023922 -0.099234 -0.072021 0.096444
polarizability: 1.78037305e+02 -4.35371757e+00 1.17038651e+02 -1.92040075e-02 -4.21961389e-03 4.13202420e+01
1716.lowfreq: -57.8654 -7.5787 -6.2200 -0.0007 -0.0005 -0.0003 6.6343 62.2503 80.2182
frequency: -57.8466 62.2498 80.2176 165.6340 243.4848 278.6871 293.7931 338.3427 415.9445 449.2507 452.7191 474.7448 484.9927 521.0103 596.8869 626.7226 632.2201 672.2229 725.2083 754.7762 801.2901 814.6389 835.9133 891.4282 974.9909 1003.6371 1025.2767 1034.2565 1067.2773 1095.6207 1110.1869 1138.5297 1186.7849 1222.9073 1299.4581 1359.3355 1382.5139 1405.6509 1417.0627 1485.1772 1574.8411 1604.0892 1611.7502 1644.5415 3138.0846 3170.1354 3184.8316 3189.0544 3342.0320 3547.4477 3687.6642
redmass: 3.4270 8.8253 6.6238 6.8489 5.4545 5.2677 8.8108 1.2878 2.5177 2.3121 3.9367 1.3226 6.2880 5.6290 3.6858 7.1410 3.8942 3.6608 6.3929 4.5293 7.7905 1.3724 1.3978 1.5195 1.3813 3.1988 1.3424 1.6949 1.6085 3.1205 1.5171 1.9509 1.4288 4.8024 1.2711 6.0478 4.4051 9.1181 3.6193 2.6218 5.1166 5.4588 5.9381 1.3012 1.0897 1.0895 1.0945 1.0965 1.0766 1.0456 1.1031
irintensity: 14.3151 0.0878 0.7167 4.7120 7.1761 10.2009 0.2361 36.6575 5.2530 129.8927 2.3795 111.5337 29.7466 5.4692 5.2609 0.5716 0.5617 45.0000 22.2045 1.9258 11.9288 33.1670 70.2155 65.0197 1.9353 9.1697 0.2157 12.3192 110.0045 11.4156 7.3531 32.2648 79.5670 301.3517 0.0351 125.8965 30.3394 13.8290 106.7484 13.3801 46.6714 4.7873 36.0862 198.7190 21.7866 3.5803 2.0556 0.7015 18.8862 23.0962 26.0488
temp: 298.150 k
press: 1.00000 atm
elementType: 8 8 7 7 7 6 6 6 6 6 6 6 1 1 1 1 1 1 1
symmnumber: 1
zpe: 361963.2 jmol-1
zpe.correction: 0.137864 hartree
zpe.thermalcorrener: 0.147532 hartree
zpe.thermalcorrenthalpy: 0.148476 hartree
zpe.thermalcorrgfe: 0.102400 hartree
zpe.sumelectzpe: -584.697263 hartree
zpe.sumelectthermal: -584.687596 hartree
zpe.sumelectthermalent: -584.686651 hartree
zpe.sumelectthermalfe: -584.732727 hartree
dipole: 6.6507 3.1238 0.0159
dipole: 7.3478
quadrupole: -71.5152 -65.3145 -72.0963
quadrupole: 10.4320 0.0520 0.0001
quadrupole: -1.8732 4.3275 -2.4543 10.4320 0.0520 0.0001
hfenergy: -584.8351271 hartree
pointgroup: C01 [X(C7H7N3O2)]
dipole: -2.5979916 1.2678415 -0.0062459 debye
dipolederiv: -0.7906277 -0.205284 -0.0000953 -0.2633344 -0.6685804 -0.0002768 -0.000425 -0.0006682 -0.2331581 -0.7613608 0.1996682 0.0003472 0.2543521 -0.6627504 -0.0007077 0.0001675 -0.0003399 -0.2290436 1.9554475 0.0070421 -0.0003024 -0.0148453 1.0899391 0.0009649 -0.0000857 0.0010458 0.1943053 -0.5993897 0.4609587 -0.0022138 0.3639352 -0.9148821 0.000011 -0.0020355 -0.0005772 -0.6824858 -0.4724949 -0.3036093 0.0012101 -0.156824 -0.8351862 0.0014428 0.0024387 0.0014758 -0.4853876 0.2018494 0.1072174 -0.0001548 0.0908134 0.0690131 0.0002999 -0.0007215 -0.0000957 0.0498523 -0.7983904 0.0039764 0.0001331 -0.0271277 0.0570599 0.000136 0.0001855 0.0000484 0.0541288 -0.2299987 -0.173104 -0.000439 -0.2356855 0.0248162 0.0005935 -0.0008811 0.0008603 -0.1689557 -0.3013744 0.1584787 0.0003718 0.1879589 0.0033265 0.0001544 0.0000471 -0.0001962 -0.1022508 0.1432731 0.1141136 0.0001104 -0.1267208 -0.0471278 0.0001198 -0.0001036 0.0001746 -0.0961963 0.2113582 -0.1419976 -0.0003502 0.1800843 -0.0103854 0.0001075 0.0003379 0.0000458 -0.1117395 0.8379687 -0.2090756 0.0009611 -0.4425478 1.237421 -0.0041302 0.0023143 -0.0034639 0.1160061 0.0084722 0.1129089 0.0001427 0.1247618 -0.0587491 -0.0004078 0.0003831 -0.0003993 0.149956 0.1519601 -0.0578856 -0.0001646 -0.0283355 0.057572 -0.0002239 -0.0004815 0.0000116 0.1525608 0.0969607 -0.0592076 -0.0000647 -0.0280153 0.0568356 -0.0002014 -0.0000859 -0.0002067 0.1719825 0.094892 0.0580911 0.0000846 0.0250515 0.0604377 -0.0001872 0.0001082 -0.0001583 0.1696689 0.1430704 -0.0420601 0.0002039 -0.0653644 0.1708115 0.000963 0.0000234 0.0008616 0.382043 0.2522708 -0.0785697 0.000609 -0.0641434 0.114162 0.0012512 0.0008717 0.0016721 0.3925095 -0.1438865 0.0483386 -0.0003891 0.2259868 0.2562668 0.000091 -0.0020575 -0.0000903 0.2762043 unknown
polarizability: 178.1534188|3.4436258|116.9225366|-0.019139|0.0045051|41.320242 unknown
InChI: InChI=1S/C7H7N3O2/c8-7(9)5-1-3-6(4-2-5)10(11)12/h1-4,8H,9H2
charge 0 multiplicity 1
19 atoms
O  3.508526 1.130451 0.001281
O  3.490368 -1.150716 -0.001263
N  2.892522 -0.005954 -0.000433
N  -3.588516 1.195962 -0.003571
N  -3.472376 -1.215679 0.004181
C  -1.404664 0.033851 0.000588
C  1.410386 0.00516 -0.000022
C  -0.669942 1.250251 0.0023
C  -0.694452 -1.197127 -0.00119
C  0.737978 1.244836 0.00199
C  0.709771 -1.22231 -0.001501
C  -2.90853 -0.022363 0.000691
H  -1.169961 2.224415 0.004737
H  -1.285972 -2.116746 -0.002148
H  1.318508 2.170773 0.003386
H  1.26892 -2.161309 -0.00288
H  -4.606092 1.206095 -0.003467
H  -3.112341 2.09356 -0.009005
H  -4.512035 -1.19065 0.003424
