program: Gaussian 09
title: 000117460
version: EM64L-G09RevD.01
frameworkgroup: C1[X(C21H16O6S2)]
method: RPBEPBE
basis: SDD
operation: Freq
keyword: #p
keyword: freq=noraman
keyword: PBEPBE/SDD
title: #p freq=noraman PBEPBE/SDD
converged: YES YES NO NO
title: Mulliken charges:
elementType: S S O O O O O O C C C C C C C C C C C C C C C C C C C C C H H H H H H H H H H H H H H H H
charge: 0.969089 0.969165 -0.561102 -0.561132 -0.502234 -0.499828 -0.502236 -0.499841 -0.772368 0.446790 0.446792 0.189050 0.188974 0.541226 0.541319 -0.355091 -0.355316 -0.424604 -0.424461 -0.298318 -0.298289 -0.375791 -0.375870 -0.399301 -0.399422 -0.272481 -0.272418 -0.246311 -0.246271 0.245979 0.245853 0.260205 0.260350 0.296610 0.296588 0.228902 0.228633 0.282943 0.282983 0.237337 0.237317 0.240772 0.240766 0.382518 0.382520
chargesum: 0.00000
title: Mulliken charges with hydrogens summed into heavy atoms:
elementType: S S O O O O O O C C C C C C C C C C C C C C C C C C C C C
charge: 0.969089 0.969165 -0.178584 -0.178612 -0.502234 -0.499828 -0.502236 -0.499841 -0.280536 0.446790 0.446792 0.189050 0.188974 0.541226 0.541319 -0.355091 -0.355316 -0.164399 -0.164111 -0.001709 -0.001701 -0.146888 -0.147236 -0.116358 -0.116439 -0.035144 -0.035101 -0.005539 -0.005504
polarizability: 3.80647915e+02 3.94555478e+01 3.32860540e+02 4.66786503e-02 1.96702258e-01 2.27823474e+02
1716.lowfreq: -4.2740 -3.1839 -2.3363 -0.0022 -0.0005 0.0008 8.9082 10.8011 15.4487
frequency: 4.4885 10.4570 15.4454 35.6966 41.1516 60.5006 78.5078 104.4815 116.8151 131.7480 135.3457 154.8494 161.5198 168.6355 174.3968 177.5379 193.0528 198.8500 225.7810 243.5357 243.8828 252.3707 298.0319 301.8156 316.2964 318.2429 351.7672 367.9211 380.1134 404.4299 413.7762 418.4046 426.7100 462.2434 467.9177 470.7510 479.4450 486.8763 515.9875 516.3273 517.5315 543.7859 549.1224 581.1782 593.6607 621.7041 626.3476 640.5815 662.6225 704.4318 725.5086 774.2649 779.2851 780.6046 781.2972 802.4306 815.9929 827.0233 828.1285 852.0343 862.3790 876.2562 879.6280 890.6255 899.6500 917.5201 958.4276 959.0288 965.7906 966.3276 974.6074 975.9873 996.6912 999.5164 1000.5602 1032.3555 1041.0644 1046.8471 1047.5521 1053.1747 1126.5677 1133.4956 1163.9072 1168.2576 1172.5182 1184.4806 1184.5400 1196.2712 1197.5022 1243.4199 1251.6468 1274.9289 1286.5290 1305.8437 1362.8258 1365.9971 1378.2356 1378.6469 1400.5726 1407.8056 1433.8636 1434.3431 1450.6804 1452.3950 1496.0576 1513.9820 1521.5195 1575.0491 1578.2819 1593.2915 1596.1488 1627.3882 1628.8364 3046.3064 3091.1154 3137.9442 3138.1034 3143.9733 3144.2987 3151.9626 3152.1010 3162.9656 3163.0540 3165.2813 3165.4505 3177.7789 3177.8494 3479.5969 3479.7012
redmass: 6.5602 6.4826 10.0469 8.8310 9.3508 7.0890 6.0520 3.9983 5.2112 7.6178 7.2657 5.4944 5.5361 5.6576 1.8469 1.7506 5.1745 4.4887 8.4257 3.8615 2.8763 3.6103 6.7965 7.9800 7.1652 7.4001 6.4171 7.1651 2.9549 4.2535 3.3031 8.2487 5.7293 4.4726 3.2353 3.6462 3.0334 5.1862 5.4142 8.2261 7.1843 9.2333 11.4979 5.3991 3.4955 6.2989 3.8616 3.6649 4.8094 5.1306 2.7466 1.5446 2.2530 4.4231 2.8055 2.2211 1.9778 9.6920 10.0147 1.3459 2.2672 2.2120 3.9626 2.1329 2.7660 2.2014 5.2922 4.7145 1.6369 1.7116 1.3948 1.4353 2.9712 1.3630 1.6525 3.6481 2.1760 1.1968 1.2035 2.3346 2.4124 2.3052 1.6665 1.6647 1.1868 1.2414 1.3246 1.4202 1.3583 2.1124 2.1146 1.5490 1.6677 1.4582 4.0789 3.7003 1.9281 1.9564 5.9895 4.6760 2.6977 2.6359 2.4243 2.3976 1.2520 3.4506 2.5268 7.7429 7.8810 6.0645 5.7800 6.3896 6.2295 1.0598 1.0999 1.0855 1.0855 1.0891 1.0891 1.0894 1.0893 1.0958 1.0959 1.0954 1.0954 1.0995 1.0995 1.0661 1.0661
irintensity: 1.0329 0.1908 0.9646 0.2450 0.0009 0.3833 0.7334 0.0044 0.0202 1.9087 0.6696 6.1047 2.6035 0.0071 46.4036 23.6720 0.2937 3.4778 10.0620 24.8742 55.4051 3.3211 21.4814 47.4963 2.2448 45.4600 1.3554 8.8325 3.0833 23.1823 0.0167 127.0774 19.7462 13.1240 3.2600 11.8776 5.8918 3.9505 9.0179 4.4005 17.9586 20.9059 209.1781 13.0100 0.3630 31.9319 21.1137 3.9992 0.4335 3.3725 0.2946 34.6774 67.1575 11.4140 44.7125 1.4598 22.9665 0.2955 185.7421 12.0430 11.4585 5.5120 18.5361 5.5381 2.8631 0.7240 25.1210 116.9302 7.0066 29.3737 0.8981 0.0009 0.3066 0.2989 0.0059 9.5967 6.6418 132.3890 14.6523 26.6857 0.0315 2.9852 0.6394 1.5732 1.1021 14.5035 0.0781 9.6330 5.1076 0.0796 22.0347 8.3587 6.1998 21.9145 13.4263 8.3918 47.6483 4.6106 5.7507 1.4852 23.0188 0.7781 16.5101 1.6935 6.8466 37.5552 17.4091 23.6506 0.0752 11.1676 1.9711 4.6299 0.2472 16.2303 4.9625 0.8162 1.4565 3.0104 12.7955 10.9444 28.7917 9.2931 7.1196 10.6340 14.6335 11.7315 16.6830 35.7796 51.5947
temp: 298.150 k
press: 1.00000 atm
elementType: 16 16 8 8 8 8 8 8 6 6 6 6 6 6 6 6 6 6 6 6 6 6 6 6 6 6 6 6 6 1 1 1 1 1 1 1 1 1 1 1 1 1 1 1 1
symmnumber: 1
zpe: 835836.5 jmol-1
zpe.correction: 0.318353 hartree
zpe.thermalcorrener: 0.345325 hartree
zpe.thermalcorrenthalpy: 0.346269 hartree
zpe.thermalcorrgfe: 0.257010 hartree
zpe.sumelectzpe: -2054.924574 hartree
zpe.sumelectthermal: -2054.897603 hartree
zpe.sumelectthermalent: -2054.896659 hartree
zpe.sumelectthermalfe: -2054.985918 hartree
dipole: 0.0029 0.0152 -3.4798
dipole: 3.4799
quadrupole: -230.1763 -174.8857 -170.8788
quadrupole: 36.8342 0.0847 -0.0310
quadrupole: -38.1961 17.0946 21.1015 36.8342 0.0847 -0.0310
hfenergy: -2055.2429277 hartree
pointgroup: C01 [X(C21H16O6S2)]
dipole: 0.0030763 -1.3690827 0.0013794 debye
polarizability: 387.4072991|0.045308|227.8241208|-34.4681658|0.2927095|326.1005098 unknown
InChI: InChI=1S/C21H16O6S2/c22-28(23,24)20-11-9-14(16-5-1-3-7-18(16)20)13-15-10-12-21(29(25,26)27)19-8-4-2-6-17(15)19/h1-12,22,25H,13H2
charge 0 multiplicity 1
45 atoms
S  -4.880698 1.472586 -1.518151
S  4.873045 1.494047 1.51235
O  -4.525599 2.88784 -0.364392
O  4.515221 2.9026 0.351271
O  -4.591765 1.935741 -3.041206
O  -6.342822 0.887604 -1.139254
O  4.58033 1.963755 3.032663
O  6.337611 0.911856 1.138607
C  0.0024 -2.071654 0.001838
C  -1.239286 -1.220154 -0.281647
C  1.241085 -1.215009 0.283324
C  -2.322684 -1.089631 0.670002
C  2.326179 -1.087064 -0.666792
C  -3.477925 -0.258049 0.343053
C  3.478662 -0.250678 -0.342157
C  -3.45681 0.386152 -0.93305
C  3.453361 0.400501 0.930327
C  -1.306191 -0.541016 -1.506031
C  1.303693 -0.52866 1.503924
C  -2.41718 0.276922 -1.846037
C  2.412021 0.293793 1.841664
C  -2.316021 -1.742948 1.9494
C  2.323666 -1.747164 -1.942701
C  -4.550336 -0.129126 1.285849
C  4.552533 -0.124072 -1.283608
C  -3.371444 -1.598325 2.850048
C  3.380385 -1.604585 -2.842157
C  -4.496006 -0.785174 2.515116
C  4.502231 -0.786799 -2.509457
H  -0.165448 -2.737484 0.8630
H  0.172694 -2.738238 -0.858209
H  -0.481651 -0.630064 -2.220972
H  0.477876 -0.61535 2.217634
H  -2.464607 0.80497 -2.803543
H  2.456086 0.827267 2.796322
H  -1.469765 -2.37669 2.230526
H  1.479585 -2.38453 -2.222123
H  -5.420164 0.481025 1.029373
H  5.420348 0.489608 -1.028745
H  -3.339589 -2.110348 3.817433
H  3.351619 -2.121811 -3.806865
H  -5.321071 -0.678132 3.226749
H  5.328362 -0.681391 -3.2201
H  -5.224492 3.586837 -0.52695
H  5.21146 3.604739 0.511675
