program: Gaussian 09
title: 000117442
version: EM64L-G09RevD.01
frameworkgroup: C1[X(C7F4N2O2)]
method: RPBEPBE
basis: SDD
operation: Freq
keyword: #pfreq=noraman
keyword: PBEPBE/SDD
title: #p freq=noraman PBEPBE/SDD
converged: NO NO NO NO
title: Mulliken charges:
elementType: F F F F O O N N C C C C C C C
charge: -0.106793 -0.106785 -0.122421 -0.122420 -0.151168 -0.151177 0.042125 0.053157 0.159510 0.111910 0.111867 0.216438 0.117299 0.117254 -0.168799
chargesum: 0.00000
title: Mulliken charges with hydrogens summed into heavy atoms:
polarizability: 1.64997849e+02 -2.88110856e-04 1.09647205e+02 4.23666156e-03 -2.26582330e-02 3.69665761e+01
1716.lowfreq: -77.3927 -6.0032 -2.1858 -0.0007 -0.0006 0.0009 5.9935 61.0188 112.3010
frequency: -77.3694 61.0169 112.3008 113.9549 118.1675 190.3869 209.7831 278.5005 293.7676 304.6253 306.3475 326.2615 368.8564 376.6195 411.2607 437.4093 468.4004 471.2214 514.4288 595.9211 646.9363 702.3008 703.0521 756.9449 760.1366 833.3193 938.9513 1023.5350 1074.4054 1166.7015 1233.5211 1340.9365 1354.4100 1370.6552 1425.8739 1450.3040 1567.1761 1613.2785 2206.1472
redmass: 16.1526 15.2578 18.5077 16.5712 14.5338 14.3255 16.4124 17.9076 13.0349 18.4580 15.3948 16.6191 15.3063 12.6142 15.4270 12.3825 13.3262 16.2934 15.5224 12.6235 12.1898 13.2445 14.9209 12.0535 12.5254 14.0433 14.1475 12.8043 13.6428 14.8179 12.5585 12.6444 12.1673 13.9309 12.2066 12.6071 12.0469 12.0244 12.6203
irintensity: 0.0000 2.4120 0.0000 0.3124 2.9523 8.5910 0.6107 0.9161 0.0272 1.3917 1.0713 0.4577 0.3155 0.0000 0.0455 0.6781 0.4439 0.1735 0.6151 0.3157 0.0000 4.3174 51.6445 0.1205 0.0814 6.5424 139.0525 34.9546 0.4608 227.8374 113.7826 0.3356 25.8178 17.0430 0.3059 391.6156 7.2743 14.1838 1.2702
temp: 298.150 k
press: 1.00000 atm
elementType: 9 9 9 9 8 8 7 7 6 6 6 6 6 6 6
symmnumber: 1
zpe: 168241.7 jmol-1
zpe.correction: 0.064080 hartree
zpe.thermalcorrener: 0.075973 hartree
zpe.thermalcorrenthalpy: 0.076918 hartree
zpe.thermalcorrgfe: 0.025569 hartree
zpe.sumelectzpe: -924.846851 hartree
zpe.sumelectthermal: -924.834957 hartree
zpe.sumelectthermalent: -924.834013 hartree
zpe.sumelectthermalfe: -924.885362 hartree
dipole: -0.6652 -0.0002 -0.0061
dipole: 0.6652
quadrupole: -109.6426 -90.9546 -76.8526
quadrupole: 0.0004 -0.0112 0.0069
quadrupole: -17.1593 1.5286 15.6307 0.0004 -0.0112 0.0069
hfenergy: -924.9109309 hartree
pointgroup: C01 [X(C7F4N2O2)]
dipole: -0.2617173 0.0000685 0.0024085 debye
dipolederiv: -0.2579448 0.241713 -0.0000022 0.2540344 -0.7251266 0.0000122 0.0001992 -0.0001451 -0.0664473 -0.2579637 -0.241693 -0.0003162 -0.2540185 -0.7250789 -0.0004347 -0.000155 -0.0004246 -0.0664435 -0.3250642 0.3465977 0.0000643 0.3065797 -0.7237875 -0.0001251 0.0001091 0.0000525 -0.0831177 -0.3250617 -0.3466031 -0.0000388 -0.3065738 -0.7237386 -0.0001061 0.0000533 -0.0003236 -0.0831158 -0.6300981 -0.1843042 0.0001904 -0.1269829 -0.563519 0.0001281 0.0007118 0.002101 -0.1877716 -0.6301538 0.1843292 -0.0004713 0.127033 -0.5635068 0.001751 0.0007684 -0.0003548 -0.1877774 1.8995355 -0.0000225 -0.0005413 -0.0000304 1.0832407 -0.0022861 -0.0002541 -0.0018543 0.2071798 -0.001815 0.0001403 0.0002501 0.000086 -0.1586126 0.0000039 0.0002441 0.0000019 -0.1898553 -0.8482385 -0.0000145 0.0006186 -0.000034 -0.0145438 0.0002684 -0.0006851 0.0001542 0.0535742 0.4198958 -0.6376477 0.000076 -0.0911872 0.734555 -0.0000478 -0.0008339 0.000127 0.120623 0.4199179 0.6376452 0.000466 0.0912124 0.7344281 0.0006473 0.0003251 0.0004103 0.1206158 0.2255763 0.0000048 0.0000056 0.0000456 0.1323442 -0.0000013 0.0001596 -0.0000006 0.1293757 0.2194714 -0.7213485 -0.0001737 -0.3257443 0.7649091 0.0000817 -0.0001974 -0.0002356 0.0831602 0.219432 0.7213452 0.0000813 0.3256985 0.7648305 0.0001256 -0.0000802 0.0004949 0.0831592 -0.1274892 -0.0001418 -0.0002088 -0.0001185 -0.0163939 -0.0000172 -0.000365 -0.0000032 0.0668407 unknown
polarizability: 164.9978488|0.0041845|109.6472055|-0.0042351|-0.0226585|36.9665761 unknown
InChI: InChI=1S/C7F4N2O2/c8-3-2(1-12)4(9)6(11)7(5(3)10)13(14)15
charge 0 multiplicity 1
15 atoms
F  1.112737 -2.460677 0.000215
F  1.112886 2.460621 0.001152
F  -1.573409 2.414014 0.00041
F  -1.573498 -2.413927 -0.000332
O  3.336809 1.13861 -0.003969
O  3.337059 -1.138316 0.000387
N  2.740795 0.000091 0.001289
N  -4.260935 -0.000285 -0.001199
C  1.24355 -0.000005 0.000837
C  0.510525 -1.219282 0.000453
C  0.510566 1.219277 0.00071
C  -1.636386 0.000044 0.000037
C  -0.896722 1.205225 0.000381
C  -0.896763 -1.205163 0.000068
C  -3.067214 0.000073 -0.000339
