program: Gaussian 09
title: 000117439
version: EM64L-G09RevD.01
frameworkgroup: C1[X(C14H19NO5)]
method: RPBEPBE
basis: SDD
operation: Freq
keyword: #p
keyword: freq=noraman
keyword: PBEPBE/SDD
title: #p freq=noraman PBEPBE/SDD
converged: YES YES NO NO
title: Mulliken charges:
elementType: O O O O O N C C C C C C C C C C C C C C H H H H H H H H H H H H H H H H H H H
charge: -0.334238 -0.428306 -0.300371 -0.218792 -0.434055 -0.409205 0.339133 -0.160481 -0.618343 0.537799 -0.711160 -0.704795 -0.708009 0.344130 0.168314 -0.359349 -0.373585 -0.344807 -0.396611 0.285281 0.306341 0.221306 0.242990 0.218511 0.208205 0.271355 0.225011 0.227290 0.204175 0.274016 0.206761 0.215714 0.335219 0.234099 0.230159 0.249997 0.216760 0.387269 0.352270
chargesum: 0.00000
title: Mulliken charges with hydrogens summed into heavy atoms:
elementType: O O O O O N C C C C C C C C C C C C C C
charge: -0.334238 -0.041036 -0.300371 -0.218792 -0.081785 -0.073986 0.339133 0.145861 -0.154046 0.537799 -0.013089 -0.048318 -0.011517 0.344130 0.168314 -0.125250 -0.143426 -0.094811 -0.179851 0.285281
polarizability: 1.63370008e+02 1.37438549e+01 2.10432611e+02 1.88409960e+01 -5.08297662e+00 1.48199665e+02
1716.lowfreq: -4.0105 -0.0008 -0.0006 -0.0005 7.0667 9.0885 16.8335 26.3265 28.6194
frequency: 16.6941 26.0879 28.5496 35.0868 52.1600 56.9163 78.7004 95.6063 117.5703 128.2666 175.4790 181.0686 201.2188 241.1817 245.3934 269.1236 286.3590 298.4119 310.5370 331.9350 340.4606 352.9865 397.7285 405.3366 408.5883 411.9330 434.3656 449.0521 474.8012 524.6104 538.4455 562.1877 589.6230 598.5019 636.8090 680.7576 699.7439 700.7705 720.6258 731.9167 763.4277 801.2722 815.8777 825.3870 834.1965 864.2569 890.0173 914.5714 920.6318 930.3820 954.2712 960.6806 972.6383 1001.0570 1006.4220 1031.2145 1033.1824 1080.7016 1101.9245 1131.5081 1144.4109 1158.8658 1179.8786 1198.1178 1218.3734 1226.6782 1248.7035 1256.3577 1261.2634 1270.3002 1297.8520 1308.7797 1320.3401 1330.4752 1373.9631 1378.8968 1395.3331 1400.3198 1428.6930 1444.7877 1465.0716 1465.7114 1467.7215 1470.4568 1480.4287 1484.8970 1503.1198 1506.8055 1598.8316 1628.0511 1644.5987 1666.6548 2988.4480 2989.2746 2994.0960 2994.7399 3047.6973 3062.7406 3079.7205 3083.2616 3095.6612 3096.9458 3111.3538 3114.2568 3118.1600 3126.2576 3140.0079 3172.2906 3522.9191 3575.2540 3582.1236
redmass: 5.3927 3.7438 7.0515 3.8803 5.1119 5.6180 6.0762 4.7766 3.9404 6.0196 1.3343 2.9019 4.6587 1.0578 1.0746 4.3857 3.9290 3.3259 4.2032 2.6438 3.4958 1.1414 3.8668 2.8794 2.8411 2.9413 2.8495 2.8840 4.5825 2.8415 3.5322 1.4094 2.0283 1.7242 6.6580 3.4417 6.1271 11.8173 4.1650 4.6909 4.9289 1.4848 2.8533 3.0627 2.0364 2.6238 2.9360 1.5997 1.6303 1.4670 1.2048 1.3834 6.1277 2.9316 2.7248 1.4138 1.4280 2.2251 1.5448 2.2736 1.3858 2.0613 1.1200 1.6839 2.2335 1.9220 2.8732 3.0223 1.3975 2.9928 1.6992 1.3559 1.4634 1.3733 1.2302 1.2319 6.0317 1.2173 2.8112 1.0465 1.1887 1.0653 1.0651 1.0662 1.0525 1.6344 1.0809 2.6812 6.4626 6.4753 8.8239 9.0732 1.0363 1.0356 1.0589 1.0371 1.0911 1.0963 1.0995 1.0992 1.0994 1.1001 1.0878 1.0999 1.0991 1.0901 1.0960 1.0952 1.0642 1.0772 1.0660
irintensity: 0.1757 1.7066 1.9205 0.2428 3.8832 0.0627 2.4347 0.4399 2.1509 0.4844 0.2508 0.1152 6.6290 0.0416 0.2394 1.6057 1.6145 3.9530 13.6225 2.9537 0.1540 144.2437 1.5941 1.9236 12.3628 0.8856 3.2706 5.3421 16.1052 30.9849 8.9286 17.7043 207.0704 99.9147 1.4979 27.0526 13.1786 36.4111 6.4470 11.5860 7.2130 33.5220 9.6904 20.2465 20.9907 5.5084 46.7271 0.8075 1.9794 9.2829 0.5451 2.3469 156.4619 31.4897 11.6819 1.0489 6.3669 226.5987 81.2573 41.9957 182.3019 418.2089 10.8924 7.7369 1.2007 58.7294 35.3681 25.8378 9.4951 21.0018 61.9555 6.4901 26.7346 27.5307 42.6514 34.7659 12.8450 34.4088 10.3350 0.9952 120.0425 9.2885 12.5094 10.5396 3.7380 201.1796 44.1435 106.1710 13.3121 43.7616 194.1353 235.6392 24.1406 11.7891 33.3832 24.8010 4.2705 12.4670 11.6892 17.3388 56.2270 33.7249 17.8851 4.5771 14.7254 12.8464 13.7467 5.4023 32.0798 47.9048 37.4846
temp: 298.150 k
press: 1.00000 atm
elementType: 8 8 8 8 8 7 6 6 6 6 6 6 6 6 6 6 6 6 6 6 1 1 1 1 1 1 1 1 1 1 1 1 1 1 1 1 1 1 1
symmnumber: 1
zpe: 818180.9 jmol-1
zpe.correction: 0.311629 hartree
zpe.thermalcorrener: 0.333027 hartree
zpe.thermalcorrenthalpy: 0.333971 hartree
zpe.thermalcorrgfe: 0.258700 hartree
zpe.sumelectzpe: -974.269478 hartree
zpe.sumelectthermal: -974.248080 hartree
zpe.sumelectthermalent: -974.247136 hartree
zpe.sumelectthermalfe: -974.322407 hartree
dipole: 1.7444 -1.0345 4.2778
dipole: 4.7342
quadrupole: -117.0242 -107.3979 -118.4792
quadrupole: 1.8904 -1.8421 1.6552
quadrupole: -2.7238 6.9025 -4.1788 1.8904 -1.8421 1.6552
hfenergy: -974.5811069 hartree
pointgroup: C01 [X(C14H19N1O5)]
dipole: 0.5885146 0.5451406 -1.6809868 debye
polarizability: 166.0498446|-18.18337|207.1427861|-19.3297361|-4.5092014|148.8096544 unknown
InChI: InChI=1S/C14H19NO5/c1-14(2,3)20-13(19)15-11(12(17)18)8-9-4-6-10(16)7-5-9/h4-7,11,15-17H,8H2,1-3H3
charge 0 multiplicity 1
39 atoms
O  2.271381 0.904445 -0.525839
O  1.768209 -3.543059 -1.096872
O  1.134639 0.30493 1.475308
O  0.595481 -4.447671 0.695362
O  -4.128047 2.726533 0.445432
N  1.10178 -1.025858 -0.456248
C  2.817046 2.214942 0.024479
C  0.258623 -2.069773 0.111085
C  -1.177247 -2.126616 -0.539577
C  -1.963644 -0.848688 -0.314591
C  3.738886 1.923751 1.225771
C  3.6100 2.756262 -1.177963
C  1.641579 3.142844 0.39242
C  1.469863 0.086936 0.280618
C  0.87934 -3.459831 -0.012365
C  -2.688546 -0.64842 0.890414
C  -1.972993 0.186716 -1.280275
C  -3.400724 0.541468 1.129245
C  -2.681906 1.388249 -1.059124
C  -3.394919 1.562298 0.150591
H  0.142882 -1.846063 1.186211
H  -1.055743 -2.327419 -1.621012
H  -1.702692 -2.993031 -0.096066
H  4.528407 1.205758 0.940862
H  4.225651 2.861196 1.552005
H  3.165033 1.510238 2.0698
H  2.945141 2.905048 -2.046399
H  4.408415 2.050934 -1.466508
H  4.072439 3.72512 -0.917838
H  1.065495 2.73185 1.236024
H  2.032851 4.136806 0.677332
H  0.967419 3.270703 -0.473375
H  1.503619 -1.149095 -1.386205
H  -2.695378 -1.435312 1.654648
H  -1.421769 0.055889 -2.218849
H  -3.960581 0.699084 2.05558
H  -2.680123 2.177454 -1.822579
H  2.117425 -4.472117 -1.168711
H  -4.055592 3.383799 -0.290391
